{"text_format":"1","workbook":"xlsx","n_sheets":14,"sheets":["Project Information","EPM Information","Y1 1. EPM Assignment","Y1 2. Comprehensive Plan","Y1 3. Six-Month Update","Y1 4. Completion Report","CY 1. Comprehensive Plan","CY 2. Six-Month Update ","CY 3. Completion Report","Utility List","uploaddata","Revision History","uploaddata collection","Protection"],"not_rendered":{"charts":0,"images":7,"macros":1,"external_links":10,"defined_names":820,"comments":2,"pivot_tables":0},"unopened":[],"bounds":{"document_bytes":16777216,"sheet_cells":100000,"rows_first":2000,"rows_last":500,"rows_between":2000,"halvings":0,"cell_chars":16384,"cell_head_chars":4096},"cells_cut":0,"cells_raw":0,"read":"whole","date_system":"1900"}

{"sheet":"Project Information","index":0,"n_rows":22,"n_cols":8,"rows_kept":22,"cut":false,"hidden":false,"merged":[]}
[null,"Energy Project Manager (EPM) Project Information",null,null,null,null,null,{"$f":"IF(COUNTIF(F3:F21, \"=Required\")=0, \"Section Complete!\", COUNTIF(F3:F21, \"=Required\") & \" Fields still need to be Entered\")","v":"14 Fields still need to be Entered"}]
[null,null,null,"Input or Select Dropdown",null,null,null,"Example Entry and Format"]
[null,"Serving Utility ",null,null,{"$f":"IF(ISBLANK(D3), \"<<<\", \"\")","v":"<<<"},{"$f":"IF(ISBLANK(D3), \"Required\", \"\")","v":"Required"},null,"Power Utility Plus"]
[null,"Proposal Submitter Name",null,null,"<<<",{"$f":"IF(ISBLANK(D4), \"Required\", \"\")","v":"Required"},null,"Jane Doe"]
[null,"Proposal Submitter Email",null,null,"<<<","Required",null,"john.doe@acmeindustrial.com"]
[null,"Proposal Submitter Phone",null,null,"<<<","Required",null,"425-999-0000"]
[null,"Company Name",null,null,"<<<","Required",null,"ACME Manufacturing"]
[null,"Company Mailing Address",null,null,"<<<","Required",null,"P.O. Box 5000 (Corporate HQ)"]
[null,"Company City",null,null,"<<<","Required",null,"Metro City"]
[null,"Company State",null,null,"<<<","Required",null,"OR"]
[null,"Company ZIP",null,null,"<<<","Required",null,94596]
[null,"NAICS Code",null,null,"<<<","Required",null,12345]
[null,"Facility Contact Name (employee at Facility)",null,null,{"$f":"IF(ISBLANK(D13), \"<<<\", \"\")","v":"<<<"},{"$f":"IF(ISBLANK(D13), \"Required\", \"\")","v":"Required"},null,"John Doe"]
[null,"Facility Contact Job Title",null,null,"<<<","Required",null,"Maintenance Manager"]
[null,"Facility Contact Phone Number",null,null,"<<<","Required",null,"360-800-0000"]
{"$rows_left_out":8}
{"sheet":"EPM Information","index":1,"n_rows":45,"n_cols":10,"rows_kept":45,"cut":false,"hidden":false,"merged":[[40,1,40,3],[41,1,41,3],[42,1,42,3],[45,1,48,4],[19,1,21,1],[34,1,37,4],[29,1,29,3],[30,1,30,3],[31,1,31,3],[8,1,9,1],[10,1,11,1],[13,5,13,6],[7,7,7,8],[15,1,18,1]]}
[null,"Energy Project Manager (EPM) Project Information"]
[null,"Project Sector",null,"Industrial"]
[null,"Busbar Factor",null,1.09056]
[null,"Incentive Rate",null,2.5000000000000001E-2,"per kWh"]
[null,"Minimum Annual Payment",null,25000]
[null,"Maximum Annual Payment",null,250000]
[]
[null,"Year ","Milestone",null,"Base Annual Salary"," Compensation Load Factor (%)","Fully Loaded Salary","Savings (kWh)"]
[null,"First Year","Comprehensive Plan","Initial",{"$f":"'Y1 2. Comprehensive Plan'!E8","v":0},{"$f":"'CY 1. Comprehensive Plan'!E10","v":0},{"$f":"E9*(1+F9)","v":0},"Savings Goal",{"$f":"F17","v":0}]
[null,null,"Completion Report","Final",{"$f":"'Y1 4. Completion Report'!E8","v":0},{"$f":"'Y1 4. Completion Report'!E9","v":0},{"$f":"E10*(1+F10)","v":0},"Acquired Savings",{"$f":"G19","v":0}]
[null,"Continuation Year","Comprehensive Plan","Initial",{"$f":"'CY 1. Comprehensive Plan'!E9","v":0},{"$f":"'CY 1. Comprehensive Plan'!E10","v":0},{"$f":"E11*(1+F11)","v":0},"Savings Goal",{"$f":"'CY 1. Comprehensive Plan'!E8","v":0}]
[null,null,"Completion Report","Final",{"$f":"'CY 3. Completion Report'!E8","v":0},{"$f":"'CY 3. Completion Report'!E9","v":0},{"$f":"E12*(1+F12)","v":0},"Acquired Savings",{"$f":"'CY 3. Completion Report'!E7","v":0}]
[null,"Savings and Payment Summary"]
[null,null,null,null,null,"Savings"]
[null,"Year","Month","Milestone","Date","Projected Busbar Savings (kWh)","Booked Busbar Savings (kWh)","Max Payment","Utility Payment Cap","Payment"]
{"$rows_left_out":31}
{"sheet":"Y1 1. EPM Assignment","index":2,"n_rows":42,"n_cols":8,"rows_kept":42,"cut":false,"hidden":false,"merged":[[13,1,16,4],[29,1,29,2],[35,1,38,4],[23,1,23,2]]}
[null,{"$f":"CONCATENATE(\"EPM:\",IF('Project Information'!D17=\"\",\"EPM Name?\",CONCATENATE('Project Information'!D7,\" - \",'Project Information'!D17)))","v":"EPM:EPM Name?"}]
[null,"EPM Submission #1: EPM Assignment"]
[]
[null,"EPM Assignment",null,null,null,null,null,{"$f":"IF(COUNTIF(D7:D11, \"                               Required\")=0, \"All Required Fields Complete!\", \"BPA Use:  \" & COUNTIF(D7:D11, \"                               Required\") & \" Fields still need to be Entered\")","v":"BPA Use:  5 Fields still need to be Entered"}]
[null,"Completed by BPA when EPM Agreement Submitted"]
[null,null,null,null,"Input or Select Dropdown",null,"Validation","Example Entry and Format"]
[null,"EPM Agreement Received -Date",null,{"$f":"IF(ISBLANK(E7), \"                               Required\", \"\")","v":"                               Required"},null,null,"Date","2012-06-12"]
[null,"EPM Agreement File Name",null,{"$f":"IF(ISBLANK(E8), \"                               Required\", \"\")","v":"                               Required"},null,null,null,"ProjectName_PTS_Design.pdf"]
[null,"EPM Commencement Date",null,{"$f":"IF(ISBLANK(E9), \"                               Required\", \"\")","v":"                               Required"},null,null,null,"2012-06-12"]
[null,"Engineering Technical Review: Name",null,{"$f":"IF(ISBLANK(E10), \"                               Required\", \"\")","v":"                               Required"},null,null,null,"Richard Miller"]
[null,"Engineering Technical Review: Date",null,{"$f":"IF(ISBLANK(E11), \"                               Required\", \"\")","v":"                               Required"},null,null,null,"2012-06-12"]
[]
[null,"Notes"]
[]
[]
{"$rows_left_out":28}
{"sheet":"Y1 2. Comprehensive Plan","index":3,"n_rows":38,"n_cols":8,"rows_kept":38,"cut":false,"hidden":false,"merged":[[13,1,16,4],[23,1,23,2],[31,1,34,4]]}
[null,{"$f":"CONCATENATE(\"EPM:\",IF('Project Information'!D17=\"\",\"EPM Name?\",CONCATENATE('Project Information'!D7,\" - \",'Project Information'!D17)))","v":"EPM:EPM Name?"}]
[null,"EPM Submission #2: Comprehensive Plan"]
[]
[null,"Comprehensive Plan",null,null,null,null,null,{"$f":"IF(COUNTIF(D7:D11, \"                               Required\")=0, \"All Required Fields Complete!\", \"BPA Use:  \" & COUNTIF(D7:D11, \"                               Required\") & \" Fields still need to be Entered\")","v":"BPA Use:  5 Fields still need to be Entered"}]
[null,"Completed by BPA when EPM Agreement Submitted"]
[null,null,null,null,"Input or Select Dropdown",null,"Validation","Example Entry and Format"]
[null,"EPM Energy Savings Goal from Comprehensive Plan",null,{"$f":"IF(ISBLANK(E7), \"                               Required\", \"\")","v":"                               Required"},null,"kWh","Date",5000000]
[null,"INITIAL - EPM Base Annual Salary",null,{"$f":"IF(ISBLANK(E8), \"                               Required\", \"\")","v":"                               Required"},null,null,null,100000]
[null,"INITIAL - EPM Compensation Load Factor (%)",null,{"$f":"IF(ISBLANK(E9), \"                               Required\", \"\")","v":"                               Required"},null,null,null,0.1]
[null,"Engineering Technical Review: Name",null,{"$f":"IF(ISBLANK(E10), \"                               Required\", \"\")","v":"                               Required"},null,null,null,"Richard Miller"]
[null,"Engineering Technical Review: Date",null,{"$f":"IF(ISBLANK(E11), \"                               Required\", \"\")","v":"                               Required"},null,null,null,"2012-06-12"]
[]
[null,"Notes"]
[]
[]
{"$rows_left_out":24}
{"sheet":"Y1 3. Six-Month Update","index":4,"n_rows":37,"n_cols":8,"rows_kept":37,"cut":false,"hidden":false,"merged":[[12,1,15,4],[22,1,22,2],[30,1,33,4]]}
[null,{"$f":"CONCATENATE(\"EPM:\",IF('Project Information'!D17=\"\",\"EPM Name?\",CONCATENATE('Project Information'!D7,\" - \",'Project Information'!D17)))","v":"EPM:EPM Name?"}]
[null,"EPM Submission  #2: Six Month Update"]
[]
[null,"Six-Month Update",null,null,null,null,null,{"$f":"IF(COUNTIF(D7:D10, \"                               Required\")=0, \"All Required Fields Complete!\", \"BPA Use:  \" & COUNTIF(D7:D10, \"                               Required\") & \" Fields still need to be Entered\")","v":"BPA Use:  4 Fields still need to be Entered"}]
[null,"Completed by BPA when Updated Comprehensive Plan is submitted"]
[null,null,null,null,"Input or Select Dropdown",null,"Validation","Example Entry and Format"]
[null,"Total Busbar Savings from Completed Projects",null,{"$f":"IF(ISBLANK(E7), \"                               Required\", \"\")","v":"                               Required"},null,"kWh",null,1000000]
[null,"Total Savings from Planned Projects",null,{"$f":"IF(ISBLANK(E8), \"                               Required\", \"\")","v":"                               Required"},null,"kWh",null,1000000]
[null,"Engineering Technical Review: Name",null,{"$f":"IF(ISBLANK(E9), \"                               Required\", \"\")","v":"                               Required"},null,null,null,"Richard Miller"]
[null,"Engineering Technical Review: Date",null,{"$f":"IF(ISBLANK(E10), \"                               Required\", \"\")","v":"                               Required"},null,null,null,"2012-06-12"]
[]
[null,"Notes"]
[]
[]
[]
{"$rows_left_out":23}
{"sheet":"Y1 4. Completion Report","index":5,"n_rows":38,"n_cols":8,"rows_kept":38,"cut":false,"hidden":false,"merged":[[13,1,16,4],[23,1,23,2],[31,1,34,4]]}
[null,{"$f":"CONCATENATE(\"EPM:\",IF('Project Information'!D17=\"\",\"EPM Name?\",CONCATENATE('Project Information'!D7,\" - \",'Project Information'!D17)))","v":"EPM:EPM Name?"}]
[null,"EPM Submission #5: Year 1 Completion Report"]
[]
[null," Year 1 Completion Report",null,null,null,null,null,{"$f":"IF(COUNTIF(D7:D11, \"                               Required\")=0, \"All Required Fields Complete!\", \"BPA Use:  \" & COUNTIF(D7:D11, \"                               Required\") & \" Fields still need to be Entered\")","v":"BPA Use:  5 Fields still need to be Entered"}]
[null,"Completed by BPA when the Year 1 Completion Report is submitted"]
[null,null,null,null,"Input or Select Dropdown",null,"Validation","Example Entry and Format"]
[null,"Total Busbar Savings from Completed Projects",null,{"$f":"IF(ISBLANK(E7), \"                               Required\", \"\")","v":"                               Required"},null,"kWh","Date",5000000]
[null,"FINAL - EPM Base Annual Salary",null,{"$f":"IF(ISBLANK(E8), \"                               Required\", \"\")","v":"                               Required"},null,null,null,100000]
[null,"FINAL - EPM Compensation Load Factor (%)",null,{"$f":"IF(ISBLANK(E9), \"                               Required\", \"\")","v":"                               Required"},null,null,null,0.1]
[null,"Engineering Technical Review: Name",null,{"$f":"IF(ISBLANK(E10), \"                               Required\", \"\")","v":"                               Required"},null,null,null,"Richard Miller"]
[null,"Engineering Technical Review: Date",null,{"$f":"IF(ISBLANK(E11), \"                               Required\", \"\")","v":"                               Required"},null,null,null,"2012-06-12"]
[]
[null,"Notes"]
[]
[]
{"$rows_left_out":24}
{"sheet":"CY 1. Comprehensive Plan","index":6,"n_rows":42,"n_cols":8,"rows_kept":42,"cut":false,"hidden":false,"merged":[[14,1,17,4],[29,1,29,2],[35,1,38,4],[23,1,23,2]]}
[null,{"$f":"CONCATENATE(\"EPM:\",IF('Project Information'!D17=\"\",\"EPM Name?\",CONCATENATE('Project Information'!D7,\" - \",'Project Information'!D17)))","v":"EPM:EPM Name?"}]
[null,"EPM Submission Continuation Year #1: Comprehensive Plan"]
[]
[null,"Comprehensive Plan",null,null,null,null,null,{"$f":"IF(COUNTIF(D8:D12, \"                               Required\")=0, \"All Required Fields Complete!\", \"BPA Use:  \" & COUNTIF(D8:D12, \"                               Required\") & \" Fields still need to be Entered\")","v":"BPA Use:  5 Fields still need to be Entered"}]
[null,"Completed by BPA when EPM Agreement Submitted"]
[null,null,null,null,"Input or Select Dropdown",null,"Validation","Example Entry and Format"]
[null,"Continuation Year Commencement Date",null,{"$f":"IF(ISBLANK(E7), \"                               Required\", \"\")","v":"                               Required"},null,null,null,"2012-06-12"]
[null,"EPM Energy Savings Goal from Comprehensive Plan",null,"                               Required",null,"kWh","Date",5000000]
[null,"INITIAL - EPM Base Annual Salary",null,"                               Required",null,null,null,100000]
[null,"INITIAL - EPM Compensation Load Factor (%)",null,"                               Required",null,null,null,0.1]
[null,"Engineering Technical Review: Name",null,"                               Required",null,null,null,"Richard Miller"]
[null,"Engineering Technical Review: Date",null,"                               Required",null,null,null,"2012-06-12"]
[]
[null,"Notes"]
[]
{"$rows_left_out":28}
{"sheet":"CY 2. Six-Month Update ","index":7,"n_rows":37,"n_cols":8,"rows_kept":37,"cut":false,"hidden":false,"merged":[[12,1,15,4],[22,1,22,2],[30,1,33,4]]}
[null,{"$f":"CONCATENATE(\"EPM:\",IF('Project Information'!D17=\"\",\"EPM Name?\",CONCATENATE('Project Information'!D7,\" - \",'Project Information'!D17)))","v":"EPM:EPM Name?"}]
[null,"EPM Submission Continuation Year #2: Six Month Update"]
[]
[null,"Six-Month Update",null,null,null,null,null,{"$f":"IF(COUNTIF(D7:D10, \"                               Required\")=0, \"All Required Fields Complete!\", \"BPA Use:  \" & COUNTIF(D7:D10, \"                               Required\") & \" Fields still need to be Entered\")","v":"BPA Use:  4 Fields still need to be Entered"}]
[null,"Completed by BPA when Updated Comprehensive Plan is submitted"]
[null,null,null,null,"Input or Select Dropdown",null,"Validation","Example Entry and Format"]
[null,"Total Busbar Savings from Completed Projects",null,{"$f":"IF(ISBLANK(E7), \"                               Required\", \"\")","v":"                               Required"},null,"kWh",null,1000000]
[null,"Total Savings from Planned Projects",null,{"$f":"IF(ISBLANK(E8), \"                               Required\", \"\")","v":"                               Required"},null,"kWh",null,1000000]
[null,"Engineering Technical Review: Name",null,{"$f":"IF(ISBLANK(E9), \"                               Required\", \"\")","v":"                               Required"},null,null,null,"Richard Miller"]
[null,"Engineering Technical Review: Date",null,{"$f":"IF(ISBLANK(E10), \"                               Required\", \"\")","v":"                               Required"},null,null,null,"2012-06-12"]
[]
[null,"Notes"]
[]
[]
[]
{"$rows_left_out":23}
{"sheet":"CY 3. Completion Report","index":8,"n_rows":38,"n_cols":8,"rows_kept":38,"cut":false,"hidden":false,"merged":[[13,1,16,4],[23,1,23,2],[31,1,34,4]]}
[null,{"$f":"CONCATENATE(\"EPM:\",IF('Project Information'!D17=\"\",\"EPM Name?\",CONCATENATE('Project Information'!D7,\" - \",'Project Information'!D17)))","v":"EPM:EPM Name?"}]
[null,"EPM Submission Continuation Year #3: Completion Report"]
[]
[null," Year 1 Completion Report",null,null,null,null,null,{"$f":"IF(COUNTIF(D7:D11, \"                               Required\")=0, \"All Required Fields Complete!\", \"BPA Use:  \" & COUNTIF(D7:D11, \"                               Required\") & \" Fields still need to be Entered\")","v":"BPA Use:  5 Fields still need to be Entered"}]
[null,"Completed by BPA when the Year 1 Completion Report is submitted"]
[null,null,null,null,"Input or Select Dropdown",null,"Validation","Example Entry and Format"]
[null,"Total Busbar Savings from Completed Projects",null,{"$f":"IF(ISBLANK(E7), \"                               Required\", \"\")","v":"                               Required"},null,"kWh","Date",5000000]
[null,"FINAL - EPM Base Annual Salary",null,{"$f":"IF(ISBLANK(E8), \"                               Required\", \"\")","v":"                               Required"},null,null,null,100000]
[null,"FINAL - EPM Compensation Load Factor (%)",null,{"$f":"IF(ISBLANK(E9), \"                               Required\", \"\")","v":"                               Required"},null,null,null,0.1]
[null,"Engineering Technical Review: Name",null,{"$f":"IF(ISBLANK(E10), \"                               Required\", \"\")","v":"                               Required"},null,null,null,"Richard Miller"]
[null,"Engineering Technical Review: Date",null,{"$f":"IF(ISBLANK(E11), \"                               Required\", \"\")","v":"                               Required"},null,null,null,"2012-06-12"]
[]
[null,"Notes"]
[]
[]
{"$rows_left_out":24}
{"sheet":"Utility List","index":9,"n_rows":137,"n_cols":12,"rows_kept":137,"cut":false,"hidden":true,"merged":[]}
["BES_Number","Account_Name","BES_Number","Description","SRR Designation","Performance Payment","Budget Cap","Cooling Zone","Heating Zone","Option 2","PNGC Member","IDEA Member"]
["10055","Albion","10055","City of Albion","SRR",0.08,0.3,2,2,"No",null,"IDEA"]
["10005","Alder","10005","Alder Mutual Light Company","SRR",0.08,0.3,1,1,"No",null,""]
["10057","Ashland","10057","City of Ashland","Non-SRR",0.04,0.2,3,1,"No",null,""]
["10015","Asotin PUD","10015","Public Utility District No. 1 of Asotin County","SRR",0.08,0.3,3,1,"No",null,""]
["10059","Bandon","10059","City of Bandon","SRR",0.08,0.3,1,1,"No",null,""]
["10024","Benton PUD","10024","Public Utility District No. 1 of Benton County","Non-SRR",0.04,0.2,3,1,"No",null,""]
["10025","Benton REA","10025","Benton Rural Electric Association","SRR",0.08,0.3,3,1,"No",null,""]
["10027","Big Bend","10027","Big Bend Electric Cooperative","SRR",0.08,0.3,2,2,"No",null,""]
["10029","Blachly-Lane","10029","Blachly-Lane Electric Cooperative","SRR",0.08,0.3,1,1,"No","PNGC",""]
["10061","Blaine","10061","City of Blaine","SRR",0.08,0.3,1,1,"No"]
["10062","Bonners Ferry","10062","City of Bonners Ferry","SRR",0.08,0.3,1,2,"No",null,""]
["10064","Burley","10064","City of Burley","Non-SRR",0.04,0.2,2,2,"No",null,""]
["10044","Canby","10044","Canby Utility Board","Non-SRR",0.04,0.2,2,1,"No",null,""]
["10065","Cascade Locks","10065","City of Cascade Locks","SRR",0.08,0.3,1,1,"No",null,"IDEA"]
{"$rows_left_out":123}
{"sheet":"uploaddata","index":10,"n_rows":2,"n_cols":31,"rows_kept":2,"cut":false,"hidden":false,"merged":[]}
["Version","ProjectType","ProjectNo","SubmittalNo","ML","projcost","busbr sav","wattred","totcred","bc ratio","bldgtype","bldg","acctno","zip","facility","state","projname","street","city","ContactName","ContactTitle","ContactPhone","ContactEmail","Sector","NAICS","SubmittalName","EMapproval","EPMname","EPMstart","BESnum","SubCompDate"]
[{"$f":"up_version","v":6.1},{"$f":"up_projecttype","v":"EPM"},{"$f":"up_projectno","v":0},1,null,null,null,null,25000,null,null,null,null,{"$f":"up_zip","v":0},{"$f":"up_facility","v":0},{"$f":"up_state","v":0},{"$f":"up_projname","v":" EPM  - 0"},{"$f":"up_street","v":0},{"$f":"up_city","v":0},{"$f":"up_cont_name","v":0},{"$f":"up_cont_title","v":0},{"$f":"up_cont_phone","v":0},{"$f":"up_cont_email","v":0},{"$f":"up_sector","v":"Industrial"},{"$f":"up_NAICS","v":0},"YEAR 1 EPM ASSIGNMENT",{"$f":"up_emapproval","v":"Yes"},{"$f":"'uploaddata collection'!E30","v":0},0,{"$f":"up_BES","v":""},"2017-10-02"]

{"sheet":"Revision History","index":11,"n_rows":17,"n_cols":3,"rows_kept":17,"cut":false,"hidden":false,"merged":[]}
[null,"Revision History"]
["Current Version:",null,6.1]
["Revision Number","Date","Description"]
[2,null,"Removed \"epm busbr sav\" AF from the uploaddata tab.  Commented out commands to populate the field in the uploaddata for uploads 3,4,6,and 7 that refer to \"epm busbr sav\".  Column AG becomes AF, and AH becomes AG.  Upload macros updated. Revised payment nomenclature to match TrakSmart and IM\nFixed Year 2, Payment 2 funding formula to address cell I100 instead of I48 Fixed I130 to include $250,000 cap nomenclature to be consistent with TrakSmart and IM. Revised incentive payment calculations to be based on busbar savings Fixed formula in cell I53 -- was not capping. Fixed formula in cell I90 -- was double counting the same year period Correctly assigned Measure Life to the appropriate years and eliminated it from Yr 0 Corrected error in the booking of savings whereby only 75% of year 1 savings is booked in year 1, and then 25% of  year 1 is booked in year 2. Various changes in labeling. Completion report savings is not assigned to any \"busbr sav\" field."]
[2.1,null,"Removed all fields from the PTR Upload EPM and uploaddata tabs that have a kWh unit value. Updated busbar factor from 1.07625 to 1.09056."]
[2.2000000000000002,null,"Linked the \"Comprehensive EPM Plan Approved\" from Upload 2 to populate the Emapproval field on the uploaddata tab "]
[2.2999999999999998,null,"Fixed logic to prevent negative payments associated with under-performing EPMs."]
[3,null,"Eliminated Carry Over Provision. Added a field for EPM Commencement Date to Milestone #1. Relocated Base Annual salary to Milestone #2. Added a field for EPM Commencement Date to Submittal #5"]
[3.1,"2012-07-06","Changed Cell I80 from \n=IF($I$61=\"Yes\",IF($I$77-$I$64-$I$32-$I$50<0,0,$I$77-$I$64-$I$32-$I$50),0)\nto\n=IF($I$77-$I$64-$I$32-$I$50<0,0,$I$77-$I$64-$I$32-$I$50)\nadded cents to all financial figures\nfixed formula in cell I65\n"]
[4,"2012-07-18","Added BES Number under serving utility field.  Changed utility name and BES reference to 'utility list' sheet.  Changed macro code to stop creation of new upload file eliminated 'terminate EPM' function at 6-mo milestone eliminated 'payment suspend' function at 6-mo milestone"]
[4,"2012-08-01","Added BES Number to upload data tab. Added Submittal Completion Date to upload data tab.  Added protection to formula fields in EPM Input Worksheet."]
[4,"2012-08-22","Sorted 'utility list' sheet by Column B to prevent vlookup error.  Protected sheet to prevent resorting."]
[4.0999999999999996,null,"Added two fields for utility-specific EPM funding caps (for Year 1 and 2).  This functionality will be required with the release of the October 2013 IM, which includes an optional capping provision for the EPM component."]
[5,"2014-10-01","Updated to match Custom Project Calculator."]
[6,"2014-12-22","Updated permissions to allow upload data tab to change with submission."]
{"$rows_left_out":3}
{"sheet":"uploaddata collection","index":12,"n_rows":33,"n_cols":11,"rows_kept":33,"cut":false,"hidden":false,"merged":[[30,8,30,10],[11,4,11,10],[2,4,2,10],[3,4,3,10],[4,4,4,10],[7,4,7,10],[9,4,9,10],[13,4,13,10],[14,4,14,10],[15,4,15,10],[16,4,16,10],[17,4,17,10],[31,4,31,10],[6,4,6,10],[8,4,8,10],[24,4,24,10],[25,4,25,10],[26,4,26,10],[28,4,28,10],[29,4,29,10],[18,4,18,10],[19,4,19,10],[20,4,20,10],[21,4,21,10],[22,4,22,10],[23,4,23,10],[12,4,12,10],[30,4,30,7]]}
[]
[null,"Excel Labels","Data Type","uploaddata cell",1,2,3,4,5,6,7]
[null,"Version","text","A2",{"$f":"'Revision History'!C2","v":6.1}]
[null,"ProjectType","text","B2","EPM"]
[null,"projectno","numeric, integer","C2",{"$f":"'Project Information'!D22","v":0}]
[null,"SubmittalNo","numeric, integer","D2",1,2,3,4,5,6,7]
[null,"ML","numeric, integer","E2"]
[null,"projcost","numeric, currency","F2"]
[null,"booked sav",null,"G2"]
[null,"wattred",null,"H2"]
[null,"totcred",null,"I2",{"$f":"'EPM Information'!J16","v":25000},{"$f":"'EPM Information'!J17","v":0},{"$f":"'EPM Information'!J18","v":0},{"$f":"'EPM Information'!J19","v":0},{"$f":"'EPM Information'!J20","v":0},{"$f":"'EPM Information'!J21","v":0},{"$f":"'EPM Information'!J22","v":0}]
[null,"bc ratio",null,"J2"]
[null,"bldgtype",null,"K2"]
[null,"bldg",null,"L2"]
[null,"acctno",null,"M2"]
{"$rows_left_out":19}
{"sheet":"Protection","index":13,"n_rows":5,"n_cols":2,"rows_kept":5,"cut":false,"hidden":true,"merged":[[0,0,0,1]]}
["Protection"]
["use","password"]
["worksheet protection","epm"]
["workbook protection","epm"]
["ECTOR Review Ranges","ecotr"]