{"text_format":"1","workbook":"xlsx","n_sheets":16,"sheets":["COVER","Definitions","Navigation","Comments","Product Classes","Efficiency Levels","Constants and Menus","Product Class Dist","Efficiency Dist","6P UEC Development","Shipments and Stock ","UEC Development","UEC","Results","SUMMARY RESULTS","Charts"],"not_rendered":{"charts":13,"images":0,"macros":1,"external_links":1,"defined_names":17,"comments":0,"pivot_tables":0},"unopened":[],"bounds":{"document_bytes":16777216,"sheet_cells":100000,"rows_first":2000,"rows_last":500,"rows_between":2000,"halvings":0,"cell_chars":16384,"cell_head_chars":4096},"cells_cut":0,"cells_raw":0,"read":"whole","date_system":"1900"}

{"sheet":"COVER","index":0,"n_rows":29,"n_cols":4,"rows_kept":29,"cut":false,"hidden":false,"merged":[[23,2,23,3],[8,2,8,3],[9,2,9,3],[10,2,10,3],[13,2,13,3],[16,2,16,3],[18,2,18,3]]}
[]
[null,null,"COVER"]
[]
[null,null,"NAVIGATION"]
[]
[null,null,"COMMENTS"]
[]
[]
[null,null,"Bonneville Power Administration"]
[null,null,"6P Energy Conservation Standards Savings Model"]
{"$rows_left_out":20}
{"sheet":"Definitions","index":1,"n_rows":32,"n_cols":4,"rows_kept":32,"cut":false,"hidden":false,"merged":[]}
[]
[null,null,"Definitions"]
[]
[null,null,"NAVIGATION"]
[]
[null,null,"COMMENTS"]
[]
[]
[null,null,"Average Megawatt (aMW)","The average number of megawatts over a specified time period"]
[null,null,"Adjustment to 6P Baseline ","Adjustment to reconcile the 6P projected energy consumption and the modeled consumption calculated using best available data."]
{"$rows_left_out":23}
{"sheet":"Navigation","index":2,"n_rows":21,"n_cols":12,"rows_kept":21,"cut":false,"hidden":false,"merged":[[12,7,14,7],[16,2,20,2],[16,9,18,9],[16,11,18,11],[20,9,22,9]]}
[]
[null,null,"NAVIGATION"]
[]
[null,null,"COMMENTS"]
[]
[]
[null,null,"INFORMATION TABS",null,"INPUT TABS",null,null,"UEC CALCULATIONS",null,"RESULTS",null,"CHARTS"]
[]
[null,null,"COVER",null,"PRODUCT CLASSES"]
[]
{"$rows_left_out":12}
{"sheet":"Comments","index":3,"n_rows":8,"n_cols":4,"rows_kept":8,"cut":false,"hidden":false,"merged":[[13,3,13,7],[14,3,14,7],[15,3,15,7],[16,3,16,7],[7,3,7,7],[8,3,8,7],[9,3,9,7],[10,3,10,7],[11,3,11,7],[12,3,12,7]]}
[]
[null,null,"Comments"]
[]
[null,null,"NAVIGATION"]
[]
[]
[null,null,"Tab","Comment"]
[null,null,"Example","Please use this space to document your comments as you review the model.  We look forward to receiving your feedback.  Thank you."]

{"sheet":"Product Classes","index":4,"n_rows":38,"n_cols":11,"rows_kept":38,"cut":false,"hidden":false,"merged":[[16,3,20,3],[16,4,17,4],[18,4,20,4],[13,3,15,3],[11,4,12,4],[14,4,15,4],[9,3,12,3]]}
[]
[null,null,"Selection of Product Classes for Model"]
[]
[null,null,"NAVIGATION"]
[]
[null,null,"COMMENTS"]
[]
[]
[null,null,"All Product Classes","6th Plan PCs","2010 DFR PCs","2014 DOE NOPR PCs","2018 DOE NOPR Analyzed PCs",null,"Model PCs","Rationale"]
[null,null,"Ice Making Head-Water Cooled-Small-Batch","6P-PC1","2010-DOE-PC1","DOE-PC1","PC1",null,"PC1","Combined Product Classes represent 91% of shipments"]
{"$rows_left_out":29}
{"sheet":"Efficiency Levels","index":5,"n_rows":259,"n_cols":6,"rows_kept":259,"cut":false,"hidden":false,"merged":[[1,2,1,3],[3,2,3,3],[5,2,5,3]]}
[]
[null,null,"Efficiency Levels and Standards for Each Product Class"]
[]
[null,null,"NAVIGATION"]
[]
[null,null,"COMMENTS"]
[]
[]
[null,null,"PC1",{"$f":"OFFSET('Product Classes'!$C$9,MATCH(C9,'Product Classes'!$I$10:$I$35,0),0)","v":"Ice Making Head-Water Cooled-Small-Batch"}]
[]
{"$rows_left_out":250}
{"sheet":"Constants and Menus","index":6,"n_rows":38,"n_cols":5,"rows_kept":38,"cut":false,"hidden":false,"merged":[]}
[]
[null,null,"Constants and Menus"]
[]
[null,null,"NAVIGATION"]
[]
[null,null,"COMMENTS"]
[]
[]
[]
[null,null,"Hours/Day",24]
{"$rows_left_out":29}
{"sheet":"Product Class Dist","index":7,"n_rows":43,"n_cols":48,"rows_kept":43,"cut":false,"hidden":false,"merged":[]}
[]
[null,null,"Product Class Distributions",null,null,null,null,null,null,null,null,null,null,null," "]
[]
[null,null,"NAVIGATION"]
[]
[null,null,"COMMENTS"]
[]
[]
[null,null,"PRE-Case",1990,{"$f":"D9+1","v":1991},{"$f":"E9+1","v":1992},1993,1994,1995,1996,1997,1998,1999,2000,2001,2002,2003,2004,2005,2006,2007,2008,{"$f":"V9+1","v":2009},2010,2011,2012,2013,2014,2015,2016,2017,2018,2019,2020,2021,2022,2023,2024,2025,2026,2027,2028,2029,2030,2031,2032,2033,2034]
[null,null,"PC1 - Ice Making Head - Water Cooled - Small - Batch",4.9786676253774136E-2,4.9786676253774136E-2,4.9786676253774136E-2,4.9786676253774136E-2,4.9786676253774136E-2,4.9786676253774136E-2,4.9786676253774136E-2,4.9786676253774136E-2,4.9786676253774136E-2,4.9786676253774136E-2,4.9786676253774136E-2,4.9786676253774136E-2,4.9786676253774136E-2,4.9786676253774136E-2,4.9786676253774136E-2,4.9786676253774136E-2,4.9786676253774136E-2,4.9786676253774136E-2,4.9786676253774136E-2,4.9786676253774136E-2,4.9786676253774136E-2,4.9786676253774136E-2,4.9786676253774136E-2,4.9786676253774136E-2,4.9786676253774136E-2,4.9786676253774136E-2,4.9786676253774136E-2,4.9786676253774136E-2,4.9786676253774136E-2,4.9786676253774136E-2,4.9786676253774136E-2,4.9786676253774136E-2,4.9786676253774136E-2,4.9786676253774136E-2,4.9786676253774136E-2,4.9786676253774136E-2,4.9786676253774136E-2,4.9786676253774136E-2,4.9786676253774136E-2,4.9786676253774136E-2,4.9786676253774136E-2,4.9786676253774136E-2,4.9786676253774136E-2,4.9786676253774136E-2,4.9786676253774136E-2]
{"$rows_left_out":34}
{"sheet":"Efficiency Dist","index":8,"n_rows":455,"n_cols":52,"rows_kept":455,"cut":false,"hidden":false,"merged":[[1,2,1,6],[3,2,3,6],[5,2,5,6]]}
[]
[null,null,"Efficiency Distributions by Product Class - Single Family"]
[]
[null,null,"NAVIGATION"]
[]
[null,null,"COMMENTS"]
[]
[]
[null,null,null,{"$f":"CONCATENATE('Efficiency Levels'!$C$9,\" - \",'Efficiency Levels'!$D$9)","v":"PC1 - Ice Making Head-Water Cooled-Small-Batch"}]
[]
{"$rows_left_out":446}
{"sheet":"6P UEC Development","index":9,"n_rows":74,"n_cols":11,"rows_kept":74,"cut":false,"hidden":false,"merged":[[19,3,20,3],[19,4,20,4],[19,5,19,7],[19,10,20,10],[49,5,51,5]]}
[]
[null,null,"6P UEC Development"]
[]
[null,null,"NAVIGATION"]
[]
[null,null,"COMMENTS"]
[]
[null,null,"UEC CALCULATION"]
[]
[null,null,"Duty Cycle and Percent of Self Contained Ice Makers"]
{"$rows_left_out":65}
{"sheet":"Shipments and Stock ","index":10,"n_rows":18,"n_cols":52,"rows_kept":18,"cut":false,"hidden":false,"merged":[]}
[]
[null,null,"Shipments and Stock"]
[]
[null,null,"NAVIGATION"]
[]
[null,null,"COMMENTS"]
[]
[null,null,"Building Type "]
[null,null,{"$f":"Results!C9","v":"TOTAL"}]
[]
{"$rows_left_out":9}
{"sheet":"UEC Development","index":11,"n_rows":245,"n_cols":5,"rows_kept":245,"cut":false,"hidden":false,"merged":[[10,3,10,4],[1,2,1,3],[3,2,3,3],[26,3,26,4],[42,3,42,4],[5,2,5,3],[58,3,58,4],[74,3,74,4],[90,3,90,4],[106,3,106,4],[122,3,122,4],[218,3,218,4],[234,3,234,4],[138,3,138,4],[154,3,154,4],[170,3,170,4],[186,3,186,4],[202,3,202,4]]}
[]
[null,null,"UEC Development "]
[]
[null,null,"NAVIGATION"]
[]
[null,null,"COMMENTS"]
[]
[]
[null,null,{"$f":"CONCATENATE('Efficiency Levels'!C9,\" - \",'Efficiency Levels'!D9)","v":"PC1 - Ice Making Head-Water Cooled-Small-Batch"}]
[]
{"$rows_left_out":236}
{"sheet":"UEC","index":12,"n_rows":18,"n_cols":48,"rows_kept":18,"cut":false,"hidden":false,"merged":[]}
[]
[null,null,"Weighted Annual UEC"]
[]
[null,null,"NAVIGATION"]
[]
[null,null,"COMMENTS"]
[]
[]
[null,null,"Market UEC (Shipment Weighted Average)"]
[null,null,null,1990,{"$f":"D10+1","v":1991},{"$f":"E10+1","v":1992},1993,1994,1995,1996,1997,1998,1999,2000,2001,2002,2003,2004,2005,2006,2007,2008,2009,2010,2011,2012,2013,2014,2015,2016,2017,2018,2019,2020,2021,2022,2023,2024,2025,2026,2027,2028,2029,2030,2031,2032,2033,2034]
{"$rows_left_out":9}
{"sheet":"Results","index":13,"n_rows":46,"n_cols":29,"rows_kept":46,"cut":false,"hidden":false,"merged":[]}
[]
[null,null,"RESULTS "]
[]
[null,null,"NAVIGATION"]
[]
[null,null,"COMMENTS"]
[]
[null,null,"Building Type "]
[null,null,"TOTAL","Dropdown "]
[]
{"$rows_left_out":37}
{"sheet":"SUMMARY RESULTS","index":14,"n_rows":12,"n_cols":4,"rows_kept":12,"cut":false,"hidden":false,"merged":[]}
[]
[null,null,"SUMMARY RESULTS"]
[]
[null,null,"NAVIGATION"]
[]
[null,null,"COMMENTS"]
[]
[]
[null,null,null,{"$f":"Results!C9","v":"TOTAL"}]
[null,null," Adjustment to 6P Baseline (aMW)","N/A"]
{"$rows_left_out":3}
{"sheet":"Charts","index":15,"n_rows":6,"n_cols":3,"rows_kept":6,"cut":false,"hidden":false,"merged":[]}
[]
[null,null,"CHARTS "]
[]
[null,null,"NAVIGATION"]
[]
[null,null,"COMMENTS"]