{"text_format":"1","workbook":"xlsx","n_sheets":23,"sheets":["COVER","Definitions","Comments","Navigation","Product Classes","Efficiency Levels","Product Specifications","Constants & Menus","Product Class Dist","Efficiency Dist","Stock Model - Polyphase","Stock Model - CSIR","Stock Model - CSCR","UEC Development","UEC - Polyphase","UEC - CSIR","UEC - CSCR","Results - Polyphase","Results - CSIR","Results - CSCR","Results - ALL","SUMMARY RESULTS","Charts"],"not_rendered":{"charts":15,"images":0,"macros":1,"external_links":0,"defined_names":25,"comments":0,"pivot_tables":0},"unopened":[],"bounds":{"document_bytes":16777216,"sheet_cells":100000,"rows_first":2000,"rows_last":500,"rows_between":2000,"halvings":0,"cell_chars":16384,"cell_head_chars":4096},"cells_cut":0,"cells_raw":0,"read":"whole","date_system":"1900"}

{"sheet":"COVER","index":0,"n_rows":28,"n_cols":4,"rows_kept":28,"cut":false,"hidden":false,"merged":[[18,2,18,3],[22,2,22,3],[8,2,8,3],[9,2,9,3],[10,2,10,3],[13,2,13,3],[16,2,16,3]]}
[]
[null,null,"COVER"]
[]
[null,null,"NAVIGATION"]
[]
[null,null,"COMMENTS"]
[]
[]
[null,null,"Bonneville Power Administration"]
[null,null,"6P Energy Conservation Standards Savings Model"]
{"$rows_left_out":19}
{"sheet":"Definitions","index":1,"n_rows":33,"n_cols":4,"rows_kept":33,"cut":false,"hidden":false,"merged":[]}
[]
[null,null,"Definitions"]
[]
[null,null,"NAVIGATION"]
[]
[null,null,"COMMENTS"]
[]
[]
[null,null,"Category","Definition"]
[null,null,"Average Megawatt (aMW)","The average number of megawatts over a specified time period"]
{"$rows_left_out":24}
{"sheet":"Comments","index":2,"n_rows":8,"n_cols":4,"rows_kept":8,"cut":false,"hidden":false,"merged":[[13,3,13,7],[14,3,14,7],[15,3,15,7],[16,3,16,7],[7,3,7,7],[8,3,8,7],[9,3,9,7],[10,3,10,7],[11,3,11,7],[12,3,12,7]]}
[]
[null,null,"Comments"]
[]
[null,null,"NAVIGATION"]
[]
[]
[null,null,"Tab","Comment"]
[null,null,"Example","Please use this space to document your comments as you review the model.  We look forward to receiving your feedback.  Thank you."]

{"sheet":"Navigation","index":3,"n_rows":27,"n_cols":14,"rows_kept":27,"cut":false,"hidden":false,"merged":[[12,13,16,13],[12,11,16,11]]}
[]
[null,null,"NAVIGATION"]
[]
[null,null,"COMMENTS"]
[]
[]
[null,null,"INFORMATION TABS",null,"INPUT TABS",null,null,"UEC CALCULATIONS",null,null,null,"RESULTS",null,"CHARTS"]
[]
[null,null,"COVER",null,"PRODUCT CLASSES",null,null,"UEC DEVELOPMENT"]
[]
{"$rows_left_out":18}
{"sheet":"Product Classes","index":4,"n_rows":20,"n_cols":9,"rows_kept":20,"cut":false,"hidden":false,"merged":[[13,3,16,9]]}
[]
[null,null,"Selection of Product Classes for Model"]
[]
[null,null,"NAVIGATION"]
[]
[null,null,"COMMENTS"]
[]
[]
[null,null,"All Product Classes","Abbreviation","2010 DFR PCs","Representative PCs","6P PCs",null,"Model PCs"]
[null,null,"Polyphase Motors","Polyphase","22 motor variations by horsepower and pole configuration","2010-DOE-PC14","N/A",null,"PC1"]
{"$rows_left_out":11}
{"sheet":"Efficiency Levels","index":5,"n_rows":57,"n_cols":8,"rows_kept":57,"cut":false,"hidden":false,"merged":[[1,2,1,3],[3,2,3,3],[5,2,5,3]]}
[]
[null,null,"Efficiency Levels and Standards for Each Product Class"]
[]
[null,null,"NAVIGATION"]
[]
[null,null,"COMMENTS"]
[]
[]
[null,null,"PC1",{"$f":"OFFSET('Product Classes'!$C$9,MATCH(C9,'Product Classes'!$I$10:$I$12,0),0)","v":"Polyphase Motors"}]
[]
{"$rows_left_out":48}
{"sheet":"Product Specifications","index":6,"n_rows":28,"n_cols":6,"rows_kept":28,"cut":false,"hidden":false,"merged":[]}
[]
[null,null,"Market and Usage Attributes "]
[]
[null,null,"NAVIGATION"]
[]
[null,null,"COMMENTS"]
[]
[]
[null,null,"Constants"]
[null,null,"Hours/Day",24]
{"$rows_left_out":19}
{"sheet":"Constants & Menus","index":7,"n_rows":36,"n_cols":4,"rows_kept":36,"cut":false,"hidden":false,"merged":[]}
[]
[null,null,"CONSTANTS & MENUS"]
[]
[null,null,"NAVIGATION"]
[]
[null,null,"COMMENTS"]
[]
[]
[null,null,"Hours/Day",24]
[null,null,"Days/Week",7]
{"$rows_left_out":27}
{"sheet":"Product Class Dist","index":8,"n_rows":35,"n_cols":57,"rows_kept":35,"cut":false,"hidden":false,"merged":[]}
[]
[null,null,"Product Class Distributions"]
[]
[null,null,"NAVIGATION"]
[]
[null,null,"COMMENTS"]
[]
[]
[null,null,"PRE-Case Shipments",{"$f":"E9-1","v":1981},{"$f":"F9-1","v":1982},1983,1984,{"$f":"I9-1","v":1985},1986,1987,1988,{"$f":"M9-1","v":1989},1990,{"$f":"M9+1","v":1991},{"$f":"N9+1","v":1992},{"$f":"O9+1","v":1993},{"$f":"P9+1","v":1994},{"$f":"Q9+1","v":1995},{"$f":"R9+1","v":1996},{"$f":"S9+1","v":1997},{"$f":"T9+1","v":1998},{"$f":"U9+1","v":1999},{"$f":"V9+1","v":2000},{"$f":"W9+1","v":2001},{"$f":"X9+1","v":2002},{"$f":"Y9+1","v":2003},{"$f":"Z9+1","v":2004},{"$f":"AA9+1","v":2005},{"$f":"AB9+1","v":2006},{"$f":"AC9+1","v":2007},{"$f":"AD9+1","v":2008},{"$f":"AE9+1","v":2009},{"$f":"AF9+1","v":2010},{"$f":"AG9+1","v":2011},{"$f":"AH9+1","v":2012},{"$f":"AI9+1","v":2013},{"$f":"AJ9+1","v":2014},{"$f":"AK9+1","v":2015},{"$f":"AL9+1","v":2016},{"$f":"AM9+1","v":2017},{"$f":"AN9+1","v":2018},{"$f":"AO9+1","v":2019},{"$f":"AP9+1","v":2020},{"$f":"AQ9+1","v":2021},{"$f":"AR9+1","v":2022},{"$f":"AS9+1","v":2023},{"$f":"AT9+1","v":2024},{"$f":"AU9+1","v":2025},{"$f":"AV9+1","v":2026},{"$f":"AW9+1","v":2027},{"$f":"AX9+1","v":2028},{"$f":"AY9+1","v":2029},{"$f":"AZ9+1","v":2030},{"$f":"BA9+1","v":2031},{"$f":"BB9+1","v":2032},{"$f":"BC9+1","v":2033},{"$f":"BD9+1","v":2034}]
[null,null,{"$f":"'Product Classes'!I10&\" - \"&OFFSET('Product Classes'!$C$9,MATCH('Product Classes'!I10,MODEL_PCS,0),0)","v":"PC1 - Polyphase Motors"},{"$f":"$AE10/((1+ShipmentGrowthRate)^($AE$9-D$9))","v":460101.47172311926},468503.85062679939,477059.6738804325,485771.74368668086,494642.91342206718,503676.08857151237,512874.22767993959,522240.3433212571,531777.50308503595,{"$f":"$AE10/((1+ShipmentGrowthRate)^($AE$9-M$9))","v":541488.8305812066},551377.50646310404,561446.76946919435,571699.91748382663,582140.30861735577,592771.36230599019,603596.56043172639,614619.44846273307,625843.63661456434,637272.80103257578,{"$f":"$AE10/((1+ShipmentGrowthRate)^($AE$9-W$9))","v":648910.68499593658},660761.10014362738,672827.92772282776,685115.11986010289,697626.70085580333,710366.76850210316,723339.49542510975,736549.13045148063,749999.99999999988,{"$f":"$AE10*(1+ShipmentGrowthRate)^(AF$9-$AE$9)","v":763696.50949856616},777643.14482705819,791844.47378654988,806305.1475953561,821029.90241239977,836023.56088839751,851291.03374537511,866837.32138502563,882667.51552644128,898786.80087375303,{"$f":"$AE10*(1+ShipmentGrowthRate)^(AP$9-$AE$9)","v":915200.45681422425},931913.85914735508,948932.48184556491,966261.89884702582,983907.78588124062,1001875.9223279551,1020172.1931100213,1038802.5906208275,1057773.2166869254,1077090.2845665007,{"$f":"$AE10*(1+ShipmentGrowthRate)^(AZ$9-$AE$9)","v":1096760.1209843387},1116789.168203953,1137183.986137555,1157951.2544945555,1179097.7749693042,1200630.473468778]
{"$rows_left_out":26}
{"sheet":"Efficiency Dist","index":9,"n_rows":99,"n_cols":60,"rows_kept":99,"cut":false,"hidden":false,"merged":[[1,2,1,6],[3,2,3,6],[5,2,5,6]]}
[]
[null,null,"Efficiency Distributions by Product Class"]
[]
[null,null,"NAVIGATION"]
[]
[null,null,"COMMENTS"]
[]
[]
[null,null,null,{"$f":"'Product Classes'!I10&\" - \"&OFFSET('Product Classes'!$C$9,MATCH('Product Classes'!I10,MODEL_PCS,0),0)","v":"PC1 - Polyphase Motors"}]
[]
{"$rows_left_out":90}
{"sheet":"Stock Model - Polyphase","index":10,"n_rows":68,"n_cols":29,"rows_kept":68,"cut":false,"hidden":false,"merged":[[1,2,1,3],[12,3,12,20],[3,2,3,3],[5,2,5,3]]}
[]
[null,null,"Stock Model - Polyphase Motors"]
[]
[null,null,"NAVIGATION"]
[]
[null,null,"COMMENTS"]
[]
[]
[null,null,null,"Initial Year","Product"]
[null,null,null,1981,"SEM"]
{"$rows_left_out":59}
{"sheet":"Stock Model - CSIR","index":11,"n_rows":68,"n_cols":29,"rows_kept":68,"cut":false,"hidden":false,"merged":[[1,2,1,3],[3,2,3,3],[12,3,12,20],[5,2,5,3]]}
[]
[null,null,"Stock Model - CSIR Motors"]
[]
[null,null,"NAVIGATION"]
[]
[null,null,"COMMENTS"]
[]
[]
[null,null,null,"Initial Year","Product"]
[null,null,null,1981,"SEM"]
{"$rows_left_out":59}
{"sheet":"Stock Model - CSCR","index":12,"n_rows":68,"n_cols":29,"rows_kept":68,"cut":false,"hidden":false,"merged":[[1,2,1,3],[3,2,3,3],[12,3,12,20],[5,2,5,3]]}
[]
[null,null,"Stock Model - CSCR Motors"]
[]
[null,null,"NAVIGATION"]
[]
[null,null,"COMMENTS"]
[]
[]
[null,null,null,"Initial Year","Product"]
[null,null,null,1981,"SEM"]
{"$rows_left_out":59}
{"sheet":"UEC Development","index":13,"n_rows":60,"n_cols":5,"rows_kept":60,"cut":false,"hidden":false,"merged":[[1,2,1,3],[3,2,3,3],[22,3,23,9],[40,3,41,9],[59,3,60,9],[5,2,5,3]]}
[]
[null,null,"UEC Development "]
[]
[null,null,"NAVIGATION"]
[]
[null,null,"COMMENTS"]
[]
[]
[null,null,{"$f":"'Product Classes'!I10&\" - \"&OFFSET('Product Classes'!$C$9,MATCH('Product Classes'!I10,MODEL_PCS,0),0)","v":"PC1 - Polyphase Motors"}]
[]
{"$rows_left_out":51}
{"sheet":"UEC - Polyphase","index":14,"n_rows":18,"n_cols":72,"rows_kept":18,"cut":false,"hidden":false,"merged":[]}
[]
[null,null,null,null,null,null,null,null,null,null,null,null,null,null,null,null,null,"Weighted Annual UEC - Polyphase Motors"]
[]
[null,null,null,null,null,null,null,null,null,null,null,null,null,null,null,null,null,"NAVIGATION"]
[]
[null,null,null,null,null,null,null,null,null,null,null,null,null,null,null,null,null,"COMMENTS"]
[]
[]
[null,null,null,null,null,null,null,null,null,null,null,null,null,null,null,null,null,"Market UEC (Shipment Weighted Average)"]
[null,null,null,null,null,null,null,null,null,null,null,null,null,null,null,null,null,null,1981,{"$f":"S10+1","v":1982},{"$f":"T10+1","v":1983},1984,1985,1986,1987,1988,1989,1990,1991,1992,1993,1994,1995,1996,1997,1998,1999,2000,2001,2002,2003,2004,2005,2006,2007,2008,2009,2010,2011,2012,2013,2014,2015,2016,2017,2018,2019,2020,2021,2022,2023,2024,2025,2026,2027,2028,2029,2030,2031,2032,{"$f":"BR10+1","v":2033},2034]
{"$rows_left_out":9}
{"sheet":"UEC - CSIR","index":15,"n_rows":18,"n_cols":72,"rows_kept":18,"cut":false,"hidden":false,"merged":[]}
[]
[null,null,null,null,null,null,null,null,null,null,null,null,null,null,null,null,null,"Weighted Annual UEC - CSIR Motors"]
[]
[null,null,null,null,null,null,null,null,null,null,null,null,null,null,null,null,null,"NAVIGATION"]
[]
[null,null,null,null,null,null,null,null,null,null,null,null,null,null,null,null,null,"COMMENTS"]
[]
[]
[null,null,null,null,null,null,null,null,null,null,null,null,null,null,null,null,null,"Market UEC (Shipment Weighted Average)"]
[null,null,null,null,null,null,null,null,null,null,null,null,null,null,null,null,null,null,1981,{"$f":"S10+1","v":1982},{"$f":"T10+1","v":1983},1984,1985,1986,1987,1988,1989,1990,1991,1992,1993,1994,1995,1996,1997,1998,1999,2000,2001,2002,2003,2004,2005,2006,2007,2008,2009,2010,2011,2012,2013,2014,2015,2016,2017,2018,2019,2020,2021,2022,2023,2024,2025,2026,2027,2028,2029,2030,2031,2032,2033,2034]
{"$rows_left_out":9}
{"sheet":"UEC - CSCR","index":16,"n_rows":18,"n_cols":72,"rows_kept":18,"cut":false,"hidden":false,"merged":[]}
[]
[null,null,null,null,null,null,null,null,null,null,null,null,null,null,null,null,null,"Weighted Annual UEC - CSCR Motors"]
[]
[null,null,null,null,null,null,null,null,null,null,null,null,null,null,null,null,null,"NAVIGATION"]
[]
[null,null,null,null,null,null,null,null,null,null,null,null,null,null,null,null,null,"COMMENTS"]
[]
[]
[null,null,null,null,null,null,null,null,null,null,null,null,null,null,null,null,null,"Market UEC (Shipment Weighted Average)"]
[null,null,null,null,null,null,null,null,null,null,null,null,null,null,null,null,null,null,1981,{"$f":"S10+1","v":1982},{"$f":"T10+1","v":1983},1984,1985,1986,1987,1988,1989,1990,1991,1992,1993,1994,1995,1996,1997,1998,1999,2000,2001,2002,2003,2004,2005,2006,2007,2008,2009,2010,2011,2012,2013,2014,2015,2016,2017,2018,2019,2020,2021,2022,2023,2024,2025,2026,2027,2028,2029,2030,2031,2032,2033,2034]
{"$rows_left_out":9}
{"sheet":"Results - Polyphase","index":17,"n_rows":44,"n_cols":33,"rows_kept":44,"cut":false,"hidden":false,"merged":[]}
[]
[null,null,"RESULTS  - Polyphase Motors"]
[]
[null,null,"NAVIGATION"]
[]
[null,null,"COMMENTS"]
[]
[]
[null,null,"Unit Energy Consumption (kWh/year) ",2005,{"$f":"D9+1","v":2006},{"$f":"E9+1","v":2007},2008,2009,2010,2011,2012,2013,2014,2015,2016,2017,2018,2019,2020,2021,2022,2023,2024,2025,2026,2027,2028,2029,2030,2031,2032,2033,2034]
[null,null,"6P Pre-case Shipment UEC*",{"$f":"D11","v":1864.5400000000002},{"$f":"E11","v":1864.5400000000002},1864.5400000000002,1864.5400000000002,1864.5400000000002,1864.5400000000002,1864.5400000000002,1864.5400000000002,1864.5400000000002,1864.5400000000002,1864.5400000000002,1864.5400000000002,1864.5400000000002,1864.5400000000002,1864.5400000000002,1864.5400000000002,1864.5400000000002,1864.5400000000002,1864.5400000000002,1864.5400000000002,1864.5400000000002,1864.5400000000002,1864.5400000000002,1864.5400000000002,1864.5400000000002,1864.5400000000002,1864.5400000000002,1864.5400000000002,1864.5400000000002,1864.5400000000002]
{"$rows_left_out":35}
{"sheet":"Results - CSIR","index":18,"n_rows":44,"n_cols":33,"rows_kept":44,"cut":false,"hidden":false,"merged":[]}
[]
[null,null,"RESULTS  - CSIR Motors"]
[]
[null,null,"NAVIGATION"]
[]
[null,null,"COMMENTS"]
[]
[]
[null,null,"Unit Energy Consumption (kWh/year) ",2005,{"$f":"D9+1","v":2006},{"$f":"E9+1","v":2007},2008,2009,2010,2011,2012,2013,2014,2015,2016,2017,2018,2019,2020,2021,2022,2023,2024,2025,2026,2027,2028,2029,2030,2031,2032,2033,2034]
[null,null,"6P Pre-case Shipment UEC*",{"$f":"D11","v":1187.08},{"$f":"E11","v":1187.08},1187.08,1187.08,1187.08,1187.08,1187.08,1187.08,1187.08,1187.08,1187.08,1187.08,1187.08,1187.08,1187.08,1187.08,1187.08,1187.08,1187.08,1187.08,1187.08,1187.08,1187.08,1187.08,1187.08,1187.08,1187.08,1187.08,1187.08,1187.08]
{"$rows_left_out":35}
{"sheet":"Results - CSCR","index":19,"n_rows":44,"n_cols":33,"rows_kept":44,"cut":false,"hidden":false,"merged":[]}
[]
[null,null,"RESULTS  - CSCR Motors"]
[]
[null,null,"NAVIGATION"]
[]
[null,null,"COMMENTS"]
[]
[]
[null,null,"Unit Energy Consumption (kWh/year) ",2005,{"$f":"D9+1","v":2006},{"$f":"E9+1","v":2007},2008,2009,2010,2011,2012,2013,2014,2015,2016,2017,2018,2019,2020,2021,2022,2023,2024,2025,2026,2027,2028,2029,2030,2031,2032,2033,2034]
[null,null,"6P Pre-case Shipment UEC*",{"$f":"D11","v":2175.5400000000004},{"$f":"E11","v":2175.5400000000004},2175.5400000000004,2175.5400000000004,2175.5400000000004,2175.5400000000004,2175.5400000000004,2175.5400000000004,2175.5400000000004,2175.5400000000004,2175.5400000000004,2175.5400000000004,2175.5400000000004,2175.5400000000004,2175.5400000000004,2175.5400000000004,2175.5400000000004,2175.5400000000004,2175.5400000000004,2175.5400000000004,2175.5400000000004,2175.5400000000004,2175.5400000000004,2175.5400000000004,2175.5400000000004,2175.5400000000004,2175.5400000000004,2175.5400000000004,2175.5400000000004,2175.5400000000004]
{"$rows_left_out":35}
{"sheet":"Results - ALL","index":20,"n_rows":44,"n_cols":33,"rows_kept":44,"cut":false,"hidden":false,"merged":[]}
[]
[null,null,"RESULTS  - All Motors"]
[]
[null,null,"NAVIGATION"]
[]
[null,null,"COMMENTS"]
[]
[]
[null,null,"Unit Energy Consumption (kWh/year) ",2005,{"$f":"D9+1","v":2006},{"$f":"E9+1","v":2007},2008,2009,2010,2011,2012,2013,2014,2015,2016,2017,2018,2019,2020,2021,2022,2023,2024,2025,2026,2027,2028,2029,2030,2031,2032,2033,2034]
[null,null,"6P Pre-case Shipment UEC*",{"$f":"D11","v":1353.8738491803279},{"$f":"E11","v":1353.8738491803279},1353.8738491803279,1353.8738491803279,1353.8738491803279,1353.8738491803279,1353.8738491803279,1353.8738491803279,1353.8738491803279,1353.8738491803279,1353.8738491803279,1353.8738491803279,1353.8738491803281,1353.8738491803279,1353.8738491803279,1353.8738491803279,1353.8738491803279,1353.8738491803283,1353.8738491803279,1353.8738491803279,1353.8738491803279,1353.8738491803279,1353.8738491803283,1353.8738491803281,1353.8738491803279,1353.8738491803279,1353.8738491803279,1353.8738491803279,1353.8738491803279,1353.8738491803279]
{"$rows_left_out":35}
{"sheet":"SUMMARY RESULTS","index":21,"n_rows":12,"n_cols":7,"rows_kept":12,"cut":false,"hidden":false,"merged":[]}
[]
[null,null,"SUMMARY RESULTS"]
[]
[null,null,"NAVIGATION"]
[]
[null,null,"COMMENTS"]
[]
[]
[null,null,null,"Polyphase","CSIR","CSCR","Total"]
[null,null,"Adjustment to 6P Baseline (aMW)","N/A","N/A","N/A","N/A"]
{"$rows_left_out":3}
{"sheet":"Charts","index":22,"n_rows":6,"n_cols":3,"rows_kept":6,"cut":false,"hidden":false,"merged":[]}
[]
[null,null,"CHARTS "]
[]
[null,null,"NAVIGATION"]
[]
[null,null,"COMMENTS"]