{"text_format":"1","workbook":"xlsx","n_sheets":28,"sheets":["COVER","Definitions","Notes","Comments","Navigation","Product Classes","Efficiency Levels","Data by Building Type","National Shipments","Shipments and Stock - SF","Shipments and Stock - MF","Shipments and Stock - MH","6P UEC Development","Constants","UEC Development","Annual SEER","UEC-SF","UEC-MF","UEC-MH","Results-SF","Results-MF","Results-MH","Results-TH","SUMMARY RESULTS","Charts-SF","Charts-MF","Charts-MH","Charts-ALL"],"not_rendered":{"charts":39,"images":0,"macros":1,"external_links":1,"defined_names":10,"comments":0,"pivot_tables":0},"unopened":[],"bounds":{"document_bytes":16777216,"sheet_cells":100000,"rows_first":2000,"rows_last":500,"rows_between":2000,"halvings":0,"cell_chars":16384,"cell_head_chars":4096},"cells_cut":0,"cells_raw":0,"read":"whole","date_system":"1900"}

{"sheet":"COVER","index":0,"n_rows":30,"n_cols":4,"rows_kept":30,"cut":false,"hidden":false,"merged":[[24,2,24,3],[8,2,8,3],[9,2,9,3],[10,2,10,3],[13,2,13,3],[16,2,16,3],[19,2,19,3],[20,2,20,3]]}
[]
[null,null,"Cover"]
[]
[null,null,"NAVIGATION"]
[]
[null,null,"COMMENTS"]
[]
[]
[null,null,"Bonneville Power Administration"]
[null,null,"6P Energy Conservation Standards Savings Model"]
{"$rows_left_out":21}
{"sheet":"Definitions","index":1,"n_rows":32,"n_cols":4,"rows_kept":32,"cut":false,"hidden":false,"merged":[]}
[]
[null,null,"Definitions"]
[]
[null,null,"NAVIGATION"]
[]
[null,null,"COMMENTS"]
[]
[]
[null,null,"Average Megawatt (aMW)","The average number of megawatts over a specified time period"]
[null,null,"Adjustment to 6P Baseline ","Adjustment to reconcile the 6P projected energy consumption and the modeled consumption calculated using best available data."]
{"$rows_left_out":23}
{"sheet":"Notes","index":2,"n_rows":12,"n_cols":3,"rows_kept":12,"cut":false,"hidden":false,"merged":[]}
[]
[null,null,"NOTES"]
[]
[null,null,"NAVIGATION"]
[]
[null,null,"COMMENTS"]
[]
[]
[null,null,"Notes"]
[]
{"$rows_left_out":3}
{"sheet":"Comments","index":3,"n_rows":8,"n_cols":4,"rows_kept":8,"cut":false,"hidden":false,"merged":[[13,3,13,7],[14,3,14,7],[15,3,15,7],[16,3,16,7],[7,3,7,7],[8,3,8,7],[9,3,9,7],[10,3,10,7],[11,3,11,7],[12,3,12,7]]}
[]
[null,null,"Comments"]
[]
[null,null,"NAVIGATION"]
[]
[]
[null,null,"Tab","Comment"]
[null,null,"Example","Please use this space to document your comments as you review the model.  We look forward to receiving your feedback.  Thank you."]

{"sheet":"Navigation","index":4,"n_rows":35,"n_cols":11,"rows_kept":35,"cut":false,"hidden":false,"merged":[[14,6,16,6],[18,2,26,2],[34,8,36,8],[18,10,20,10],[22,10,24,10],[26,10,28,10],[30,10,32,10],[30,8,32,8],[18,6,20,6],[22,6,24,6],[26,6,28,6],[18,8,20,8],[22,8,24,8],[26,8,28,8]]}
[]
[null,null,"NAVIGATION"]
[]
[null,null,"COMMENTS"]
[]
[]
[null,null,"INFORMATION TABS",null,"INPUT TABS",null,"UEC CALCULATIONS",null,"RESULTS",null,"CHARTS"]
[]
[null,null,"COVER",null,"PRODUCT CLASSES"]
[]
{"$rows_left_out":26}
{"sheet":"Product Classes","index":5,"n_rows":22,"n_cols":9,"rows_kept":22,"cut":false,"hidden":false,"merged":[[9,3,10,3]]}
[]
[null,null,"Selection of Product Classes for Model"]
[]
[null,null,"NAVIGATION"]
[]
[null,null,"COMMENTS"]
[]
[]
[null,null,"All Product Classes (PCs)","2011 DOE Final Rule PCs 1","DOE Representative PCs 2","6P PCs 3",null,"Model PCs","Rationale 3"]
[null,null,"Split system air conditioners (Coil Only)","PC1","PC1","6P CAC",null,"PC1"]
{"$rows_left_out":13}
{"sheet":"Efficiency Levels","index":6,"n_rows":65,"n_cols":5,"rows_kept":65,"cut":false,"hidden":false,"merged":[[1,2,1,3],[3,2,3,3],[5,2,5,3]]}
[]
[null,null,"Efficiency Levels and Standards for Each Product Class"]
[]
[null,null,"NAVIGATION"]
[]
[null,null,"COMMENTS"]
[]
[]
[null,null,"PC1",{"$f":"OFFSET('Product Classes'!$C$9,MATCH(C9,'Product Classes'!$H$10:$H$16,0),0)","v":"Split system air conditioners (Coil Only)"}]
[]
{"$rows_left_out":56}
{"sheet":"Data by Building Type","index":7,"n_rows":53,"n_cols":21,"rows_kept":53,"cut":false,"hidden":false,"merged":[]}
[]
[null,null,"Data by Building Type"]
[]
[null,null,"NAVIGATION"]
[]
[null,null,"COMMENTS"]
[]
[]
[null,null,{"$f":"MODEL_NAME","v":"CENTRAL AC"},"Single Family","Multi-Family","Manufactured Homes","Total Homes","Source"]
[null,null,"Lifetime (years)",{"$f":"ROUND(INDEX([1]!LIFETIMES_TABLE,\nMATCH($C$9,[1]!APPLIANCES,0),\nMATCH(D$9,[1]!LIFETIMES_HOUSING_TYPE,0)),0)","v":19},{"$f":"ROUND(INDEX([1]!LIFETIMES_TABLE,\nMATCH($C$9,[1]!APPLIANCES,0),\nMATCH(E$9,[1]!LIFETIMES_HOUSING_TYPE,0)),0)","v":19},{"$f":"ROUND(INDEX([1]!LIFETIMES_TABLE,\nMATCH($C$9,[1]!APPLIANCES,0),\nMATCH(F$9,[1]!LIFETIMES_HOUSING_TYPE,0)),0)","v":19},{"$f":"ROUND(INDEX([1]!LIFETIMES_TABLE,\nMATCH($C$9,[1]!APPLIANCES,0),\nMATCH(G$9,[1]!LIFETIMES_HOUSING_TYPE,0)),0)","v":19},"DOE Central Air Conditioners and Heat Pumps 2011 Final Rule, Technical Support Document Chapter 8: Lifecycle Cost Analysis, Section 8.2.3.5 Lifetime (page 8-59)"]
{"$rows_left_out":44}
{"sheet":"National Shipments","index":8,"n_rows":117,"n_cols":29,"rows_kept":117,"cut":false,"hidden":false,"merged":[[1,2,1,3],[3,2,3,3],[5,2,5,3]]}
[]
[null,null,"National Shipments"]
[]
[null,null,"NAVIGATION"]
[]
[null,null,"COMMENTS"]
[]
[]
[null,null,"PRE-CASE SHIPMENTS"]
[]
{"$rows_left_out":108}
{"sheet":"Shipments and Stock - SF","index":9,"n_rows":15,"n_cols":58,"rows_kept":15,"cut":false,"hidden":false,"merged":[]}
[]
[null,null,"Shipments and Stock - SF"]
[]
[null,null,"NAVIGATION"]
[]
[null,null,"COMMENTS"]
[]
[]
[null,null,{"$f":"MODEL_NAME","v":"CENTRAL AC"}]
[null,null,null,null,1981,1982,1983,1984,1985,1986,1987,1988,1989,1990,1991,1992,1993,1994,1995,1996,1997,1998,1999,2000,2001,2002,2003,2004,2005,2006,2007,2008,2009,2010,2011,2012,2013,2014,2015,2016,2017,2018,2019,2020,2021,2022,2023,2024,2025,2026,2027,2028,2029,2030,2031,2032,2033,2034]
{"$rows_left_out":6}
{"sheet":"Shipments and Stock - MF","index":10,"n_rows":15,"n_cols":58,"rows_kept":15,"cut":false,"hidden":false,"merged":[]}
[]
[null,null,"Shipments and Stock - MF"]
[]
[null,null,"NAVIGATION"]
[]
[null,null,"COMMENTS"]
[]
[]
[null,null,{"$f":"MODEL_NAME","v":"CENTRAL AC"}]
[null,null,null,null,1981,1982,1983,1984,1985,1986,1987,1988,1989,1990,1991,1992,1993,1994,1995,1996,1997,1998,1999,2000,2001,2002,2003,2004,2005,2006,2007,2008,2009,2010,2011,2012,2013,2014,2015,2016,2017,2018,2019,2020,2021,2022,2023,2024,2025,2026,2027,2028,2029,2030,2031,2032,2033,2034]
{"$rows_left_out":6}
{"sheet":"Shipments and Stock - MH","index":11,"n_rows":15,"n_cols":58,"rows_kept":15,"cut":false,"hidden":false,"merged":[]}
[]
[null,null,"Shipments and Stock - MH"]
[]
[null,null,"NAVIGATION"]
[]
[null,null,"COMMENTS"]
[]
[]
[null,null,{"$f":"MODEL_NAME","v":"CENTRAL AC"}]
[null,null,null,null,1981,1982,1983,1984,1985,1986,1987,1988,1989,1990,1991,1992,1993,1994,1995,1996,1997,1998,1999,2000,2001,2002,2003,2004,2005,2006,2007,2008,2009,2010,2011,2012,2013,2014,2015,2016,2017,2018,2019,2020,2021,2022,2023,2024,2025,2026,2027,2028,2029,2030,2031,2032,2033,2034]
{"$rows_left_out":6}
{"sheet":"6P UEC Development","index":12,"n_rows":15,"n_cols":28,"rows_kept":15,"cut":false,"hidden":false,"merged":[]}
[]
[null,null,"6P UEC Development"]
[]
[null,null,"NAVIGATION"]
[]
[null,null,"COMMENTS"]
[]
[]
[null,null,"Sales per Stock Average Unit (KWh/Unit)"]
[null,null,null,2010,2011,2012,2013,2014,2015,2016,2017,2018,2019,2020,2021,2022,2023,2024,2025,2026,2027,2028,2029,2030,2031,2032,2033,2034]
{"$rows_left_out":6}
{"sheet":"Constants","index":13,"n_rows":13,"n_cols":4,"rows_kept":13,"cut":false,"hidden":false,"merged":[]}
[]
[null,null,"Constants"]
[]
[null,null,"NAVIGATION"]
[]
[null,null,"COMMENTS"]
[]
[]
[null,null,"Constant","Value"]
[null,null,"Hours/Day",24]
{"$rows_left_out":4}
{"sheet":"UEC Development","index":14,"n_rows":41,"n_cols":12,"rows_kept":41,"cut":false,"hidden":false,"merged":[[9,3,9,5],[9,7,9,9],[21,3,21,5],[21,7,21,9],[33,3,33,5],[33,7,33,9]]}
[]
[null,null,"UEC Development"]
[]
[null,null,"NAVIGATION"]
[]
[null,null,"COMMENTS"]
[]
[]
[null,null,"Single Family "]
[null,null,null,"Cooling Energy Use (kWh/year)",null,null,null,"Cooling Zone Allocation",null,null,null,"Weighted Average UEC"]
{"$rows_left_out":32}
{"sheet":"Annual SEER","index":15,"n_rows":22,"n_cols":57,"rows_kept":22,"cut":false,"hidden":false,"merged":[]}
[]
[null,null,"Weighted Average Annual SEER"]
[]
[null,null,"NAVIGATION"]
[]
[null,null,"COMMENTS"]
[]
[]
[null,null,"Single Family"]
[null,null,null,1981,{"$f":"D10+1","v":1982},{"$f":"E10+1","v":1983},1984,1985,1986,1987,1988,1989,1990,1991,1992,1993,1994,1995,1996,1997,1998,1999,2000,2001,2002,2003,2004,2005,2006,2007,2008,2009,2010,2011,2012,{"$f":"AI10+1","v":2013},{"$f":"AJ10+1","v":2014},{"$f":"AK10+1","v":2015},{"$f":"AL10+1","v":2016},{"$f":"AM10+1","v":2017},{"$f":"AN10+1","v":2018},{"$f":"AO10+1","v":2019},{"$f":"AP10+1","v":2020},{"$f":"AQ10+1","v":2021},{"$f":"AR10+1","v":2022},{"$f":"AS10+1","v":2023},{"$f":"AT10+1","v":2024},{"$f":"AU10+1","v":2025},{"$f":"AV10+1","v":2026},{"$f":"AW10+1","v":2027},{"$f":"AX10+1","v":2028},{"$f":"AY10+1","v":2029},{"$f":"AZ10+1","v":2030},{"$f":"BA10+1","v":2031},{"$f":"BB10+1","v":2032},{"$f":"BC10+1","v":2033},{"$f":"BD10+1","v":2034}]
{"$rows_left_out":13}
{"sheet":"UEC-SF","index":16,"n_rows":17,"n_cols":57,"rows_kept":17,"cut":false,"hidden":false,"merged":[]}
[]
[null,null,"Weighted Average Annual UEC - Single Family"]
[]
[null,null,"NAVIGATION"]
[]
[null,null,"COMMENTS"]
[]
[]
[null,null,"Market UEC (Shipment Weighted Average)"]
[null,null,null,1981,1982,1983,1984,1985,1986,1987,1988,1989,1990,1991,1992,1993,1994,1995,1996,1997,1998,1999,2000,2001,2002,2003,2004,2005,2006,2007,2008,2009,2010,2011,2012,2013,2014,2015,2016,2017,2018,2019,2020,2021,2022,2023,2024,2025,2026,2027,2028,2029,2030,2031,2032,2033,2034]
{"$rows_left_out":8}
{"sheet":"UEC-MF","index":17,"n_rows":17,"n_cols":57,"rows_kept":17,"cut":false,"hidden":false,"merged":[]}
[]
[null,null,"Weighted Average Annual UEC - Multi Family"]
[]
[null,null,"NAVIGATION"]
[]
[null,null,"COMMENTS"]
[]
[]
[null,null,"Market UEC (Shipment Weighted Average)"]
[null,null,null,1981,{"$f":"D10+1","v":1982},{"$f":"E10+1","v":1983},1984,1985,1986,1987,1988,1989,1990,1991,1992,1993,1994,1995,1996,1997,1998,1999,2000,2001,2002,2003,2004,2005,2006,2007,2008,2009,2010,2011,2012,2013,2014,2015,2016,2017,2018,2019,2020,2021,2022,2023,2024,2025,2026,2027,2028,2029,2030,2031,2032,2033,2034]
{"$rows_left_out":8}
{"sheet":"UEC-MH","index":18,"n_rows":17,"n_cols":57,"rows_kept":17,"cut":false,"hidden":false,"merged":[]}
[]
[null,null,"Weighted Average Annual UEC - Manufactured Homes"]
[]
[null,null,"NAVIGATION"]
[]
[null,null,"COMMENTS"]
[]
[]
[null,null,"Market UEC (Shipment Weighted Average)"]
[null,null,null,1981,{"$f":"D10+1","v":1982},{"$f":"E10+1","v":1983},1984,1985,1986,1987,1988,1989,1990,1991,1992,1993,1994,1995,1996,1997,1998,1999,2000,2001,2002,2003,2004,2005,2006,2007,2008,2009,2010,2011,2012,2013,2014,2015,2016,2017,2018,2019,2020,2021,2022,2023,2024,2025,2026,2027,2028,2029,2030,2031,2032,2033,2034]
{"$rows_left_out":8}
{"sheet":"Results-SF","index":19,"n_rows":46,"n_cols":28,"rows_kept":46,"cut":false,"hidden":false,"merged":[]}
[]
[null,null,"RESULTS - Single Family"]
[]
[null,null,"NAVIGATION"]
[]
[null,null,"COMMENTS"]
[]
[]
[null,null,"SINGLE FAMILY"]
[]
{"$rows_left_out":37}
{"sheet":"Results-MF","index":20,"n_rows":46,"n_cols":28,"rows_kept":46,"cut":false,"hidden":false,"merged":[]}
[]
[null,null,"RESULTS - Multi-Family"]
[]
[null,null,"NAVIGATION"]
[]
[null,null,"COMMENTS"]
[]
[]
[null,null,"MULTI-FAMILY"]
[]
{"$rows_left_out":37}
{"sheet":"Results-MH","index":21,"n_rows":46,"n_cols":28,"rows_kept":46,"cut":false,"hidden":false,"merged":[]}
[]
[null,null,"RESULTS - Manufactured Homes"]
[]
[null,null,"NAVIGATION"]
[]
[null,null,"COMMENTS"]
[]
[]
[null,null,"MANUFACTURED HOMES"]
[]
{"$rows_left_out":37}
{"sheet":"Results-TH","index":22,"n_rows":46,"n_cols":28,"rows_kept":46,"cut":false,"hidden":false,"merged":[]}
[]
[null,null,"RESULTS - Total Homes"]
[]
[null,null,"NAVIGATION"]
[]
[null,null,"COMMENTS"]
[]
[]
[null,null,"TOTAL HOMES"]
[]
{"$rows_left_out":37}
{"sheet":"SUMMARY RESULTS","index":23,"n_rows":12,"n_cols":7,"rows_kept":12,"cut":false,"hidden":false,"merged":[]}
[]
[null,null,"SUMMARY RESULTS"]
[]
[null,null,"NAVIGATION"]
[]
[null,null,"COMMENTS"]
[]
[]
[null,null,{"$f":"MODEL_NAME","v":"CENTRAL AC"},"Single Family","Multi-Family","Manufactured Homes","TOTAL"]
[null,null,"Adjustment to 6P Baseline (aMW)","n/a","n/a","n/a","n/a"]
{"$rows_left_out":3}
{"sheet":"Charts-SF","index":24,"n_rows":6,"n_cols":3,"rows_kept":6,"cut":false,"hidden":false,"merged":[]}
[]
[null,null,"CHARTS - Single Family"]
[]
[null,null,"NAVIGATION"]
[]
[null,null,"COMMENTS"]

{"sheet":"Charts-MF","index":25,"n_rows":6,"n_cols":3,"rows_kept":6,"cut":false,"hidden":false,"merged":[]}
[]
[null,null,"CHARTS - Multi-Family"]
[]
[null,null,"NAVIGATION"]
[]
[null,null,"COMMENTS"]

{"sheet":"Charts-MH","index":26,"n_rows":6,"n_cols":3,"rows_kept":6,"cut":false,"hidden":false,"merged":[]}
[]
[null,null,"CHARTS - Manufactured Homes"]
[]
[null,null,"NAVIGATION"]
[]
[null,null,"COMMENTS"]

{"sheet":"Charts-ALL","index":27,"n_rows":6,"n_cols":3,"rows_kept":6,"cut":false,"hidden":false,"merged":[]}
[]
[null,null,"CHARTS - ALL BUILDING TYPES"]
[]
[null,null,"NAVIGATION"]
[]
[null,null,"COMMENTS"]