{"text_format":"1","workbook":"xlsx","n_sheets":29,"sheets":["COVER","Definitions","Comments","Navigation","Product Classes","Efficiency Levels","Data by Building Type","Product Class Dist","Shipments and Stock - SF","Shipments and Stock - MF","Shipments and Stock - MH","Efficiency Dist - SF","Efficiency Dist - MF","Efficiency Dist - MH","6P UEC Development","Constants","UEC Development","UEC-SF","UEC-MF","UEC-MH","Results-SF","Results-MF","Results-MH","Results-TH","SUMMARY RESULTS","Charts-SF","Charts-MF","Charts-MH","Charts-TH"],"not_rendered":{"charts":39,"images":0,"macros":1,"external_links":1,"defined_names":13,"comments":0,"pivot_tables":0},"unopened":[],"bounds":{"document_bytes":16777216,"sheet_cells":100000,"rows_first":2000,"rows_last":500,"rows_between":2000,"halvings":0,"cell_chars":16384,"cell_head_chars":4096},"cells_cut":0,"cells_raw":0,"read":"whole","date_system":"1900"}

{"sheet":"COVER","index":0,"n_rows":28,"n_cols":4,"rows_kept":28,"cut":false,"hidden":false,"merged":[[22,2,22,3],[8,2,8,3],[9,2,9,3],[10,2,10,3],[13,2,13,3],[16,2,16,3],[18,2,18,3]]}
[]
[null,null,"Cover"]
[]
[null,null,"NAVIGATION"]
[]
[null,null,"COMMENTS"]
[]
[]
[null,null,"Bonneville Power Administration"]
[null,null,"6P Energy Conservation Standards Savings Model"]
{"$rows_left_out":19}
{"sheet":"Definitions","index":1,"n_rows":32,"n_cols":4,"rows_kept":32,"cut":false,"hidden":false,"merged":[]}
[]
[null,null,"Definitions"]
[]
[null,null,"NAVIGATION"]
[]
[null,null,"COMMENTS"]
[]
[]
[null,null,"Average Megawatt (aMW)","The average number of megawatts over a specified time period"]
[null,null,"Adjustment to 6P Baseline ","Adjustment to reconcile the 6P projected energy consumption and the modeled consumption calculated using best available data."]
{"$rows_left_out":23}
{"sheet":"Comments","index":2,"n_rows":8,"n_cols":4,"rows_kept":8,"cut":false,"hidden":false,"merged":[[7,3,7,7],[14,3,14,7],[15,3,15,7],[16,3,16,7],[8,3,8,7],[9,3,9,7],[10,3,10,7],[11,3,11,7],[12,3,12,7],[13,3,13,7]]}
[]
[null,null,"Comments"]
[]
[null,null,"NAVIGATION"]
[]
[]
[null,null,"Tab","Comment"]
[null,null,"Example","Please use this space to document your comments as you review the model.  We look forward to receiving your feedback.  Thank you."]

{"sheet":"Navigation","index":3,"n_rows":33,"n_cols":11,"rows_kept":33,"cut":false,"hidden":false,"merged":[[10,6,12,6],[16,2,24,2],[32,8,34,8],[16,10,18,10],[20,10,22,10],[24,10,26,10],[28,10,30,10],[28,8,30,8],[16,6,18,6],[20,6,22,6],[24,6,26,6],[16,8,18,8],[20,8,22,8],[24,8,26,8]]}
[]
[null,null,"NAVIGATION"]
[]
[null,null,"COMMENTS"]
[]
[]
[null,null,"INFORMATION TABS",null,"INPUT TABS",null,"UEC CALCULATIONS",null,"RESULTS",null,"CHARTS"]
[]
[null,null,"COVER",null,"PRODUCT CLASSES"]
[]
{"$rows_left_out":24}
{"sheet":"Product Classes","index":4,"n_rows":20,"n_cols":9,"rows_kept":20,"cut":false,"hidden":false,"merged":[]}
[]
[null,null,"Selection of Product Classes for Model"]
[]
[null,null,"NAVIGATION"]
[]
[null,null,"COMMENTS"]
[]
[]
[null,null,"All Product Classes (PCs)","2011 DOE Final Rule PCs 1","DOE Representative PCs 1","6P PCs 2",null,"Model PCs","Rationale 3"]
[null,null,"Vented Electric, Standard (4.4 ft3 or greater capacity)","PC1","PC1","PC1",null,"PC1","Product class represents over 97% of shipments of electric products"]
{"$rows_left_out":11}
{"sheet":"Efficiency Levels","index":5,"n_rows":21,"n_cols":6,"rows_kept":21,"cut":false,"hidden":false,"merged":[[1,2,1,3],[3,2,3,3],[5,2,5,3]]}
[]
[null,null,"Efficiency Levels and Standards for Each Product Class"]
[]
[null,null,"NAVIGATION"]
[]
[null,null,"COMMENTS"]
[]
[]
[null,null,"PC1",{"$f":"OFFSET('Product Classes'!$C$9,MATCH(C9,'Product Classes'!$H$10:$H$15,0),0)","v":"Vented Electric, Standard (4.4 ft3 or greater capacity)"}]
[]
{"$rows_left_out":12}
{"sheet":"Data by Building Type","index":6,"n_rows":32,"n_cols":8,"rows_kept":32,"cut":false,"hidden":false,"merged":[]}
[]
[null,null,"Data by Building Type"]
[]
[null,null,"NAVIGATION"]
[]
[null,null,"COMMENTS"]
[]
[]
[null,null,{"$f":"MODEL_NAME","v":"Electric Clothes Dryers"},"Single Family","Multi-Family","Manufactured Homes","Total Homes","Source"]
[null,null,"Lifetime (years)",{"$f":"ROUND(INDEX([1]!LIFETIMES_TABLE,\nMATCH($C$9,[1]!APPLIANCES,0),\nMATCH(D9,[1]!LIFETIMES_HOUSING_TYPE,0)),0)","v":16},{"$f":"ROUND(INDEX([1]!LIFETIMES_TABLE,\nMATCH($C$9,[1]!APPLIANCES,0),\nMATCH(E9,[1]!LIFETIMES_HOUSING_TYPE,0)),0)","v":16},{"$f":"ROUND(INDEX([1]!LIFETIMES_TABLE,\nMATCH($C$9,[1]!APPLIANCES,0),\nMATCH(F9,[1]!LIFETIMES_HOUSING_TYPE,0)),0)","v":16},{"$f":"ROUND(INDEX([1]!LIFETIMES_TABLE,\nMATCH($C$9,[1]!APPLIANCES,0),\nMATCH(G9,[1]!LIFETIMES_HOUSING_TYPE,0)),0)","v":16},"2011 DOE Clothes Dryer Direct Final Rule: Technical Support Document Chapter 9: Shipments Analysis - Section 9.3.1.2 Markets and Model Calibration \"lifetime distribution with an average value of 16 years\""]
{"$rows_left_out":23}
{"sheet":"Product Class Dist","index":7,"n_rows":15,"n_cols":48,"rows_kept":15,"cut":false,"hidden":false,"merged":[]}
[]
[null,null,"Product Class Distributions"]
[]
[null,null,"NAVIGATION"]
[]
[null,null,"COMMENTS"]
[]
[]
[null,null,"PRE-Case",1990,{"$f":"D9+1","v":1991},{"$f":"E9+1","v":1992},1993,1994,1995,1996,1997,1998,1999,2000,2001,2002,2003,2004,2005,2006,2007,2008,{"$f":"V9+1","v":2009},2010,2011,2012,2013,2014,2015,2016,2017,2018,2019,2020,2021,2022,2023,2024,2025,2026,2027,2028,2029,2030,2031,2032,2033,2034]
[null,null,{"$f":"'Product Classes'!H10&\" - \"&OFFSET('Product Classes'!$C$9,MATCH('Product Classes'!H10,MODEL_PCS,0),0)","v":"PC1 - Vented Electric, Standard (4.4 ft3 or greater capacity)"},1,1,1,1,1,1,1,1,1,1,1,1,1,1,1,1,1,1,1,1,1,1,1,1,1,1,1,1,1,1,1,1,1,1,1,1,1,1,1,1,1,1,1,1,1]
{"$rows_left_out":6}
{"sheet":"Shipments and Stock - SF","index":8,"n_rows":15,"n_cols":58,"rows_kept":15,"cut":false,"hidden":false,"merged":[]}
[]
[null,null,"Shipments and Stock - SF"]
[]
[null,null,"NAVIGATION"]
[]
[null,null,"COMMENTS"]
[]
[]
[null,null,{"$f":"MODEL_NAME","v":"Electric Clothes Dryers"}]
[null,null,null,null,1981,1982,1983,1984,1985,1986,1987,1988,1989,1990,1991,1992,1993,1994,1995,1996,1997,1998,1999,2000,2001,2002,2003,2004,2005,2006,2007,2008,2009,2010,2011,2012,2013,2014,2015,2016,2017,2018,2019,2020,2021,2022,2023,2024,2025,2026,2027,2028,2029,2030,2031,2032,2033,2034]
{"$rows_left_out":6}
{"sheet":"Shipments and Stock - MF","index":9,"n_rows":15,"n_cols":58,"rows_kept":15,"cut":false,"hidden":false,"merged":[]}
[]
[null,null,"Shipments and Stock - MF"]
[]
[null,null,"NAVIGATION"]
[]
[null,null,"COMMENTS"]
[]
[]
[null,null,{"$f":"MODEL_NAME","v":"Electric Clothes Dryers"}]
[null,null,null,null,1981,1982,1983,1984,1985,1986,1987,1988,1989,1990,1991,1992,1993,1994,1995,1996,1997,1998,1999,2000,2001,2002,2003,2004,2005,2006,2007,2008,2009,2010,2011,2012,2013,2014,2015,2016,2017,2018,2019,2020,2021,2022,2023,2024,2025,2026,2027,2028,2029,2030,2031,2032,2033,2034]
{"$rows_left_out":6}
{"sheet":"Shipments and Stock - MH","index":10,"n_rows":15,"n_cols":58,"rows_kept":15,"cut":false,"hidden":false,"merged":[]}
[]
[null,null,"Shipments and Stock - MH"]
[]
[null,null,"NAVIGATION"]
[]
[null,null,"COMMENTS"]
[]
[]
[null,null,{"$f":"MODEL_NAME","v":"Electric Clothes Dryers"}]
[null,null,null,null,1981,1982,1983,1984,1985,1986,1987,1988,1989,1990,1991,1992,1993,1994,1995,1996,1997,1998,1999,2000,2001,2002,2003,2004,2005,2006,2007,2008,2009,2010,2011,2012,2013,2014,2015,2016,2017,2018,2019,2020,2021,2022,2023,2024,2025,2026,2027,2028,2029,2030,2031,2032,2033,2034]
{"$rows_left_out":6}
{"sheet":"Efficiency Dist - SF","index":11,"n_rows":33,"n_cols":61,"rows_kept":33,"cut":false,"hidden":false,"merged":[[1,2,1,6],[3,2,3,6],[5,2,5,6]]}
[]
[null,null,"Efficiency Distributions by Product Class - Single Family"]
[]
[null,null,{"$f":"Navigation!$C$15","v":"NAVIGATION"}]
[]
[null,null,"COMMENTS"]
[]
[]
[null,null,null,{"$f":"'Product Classes'!H10&\" - \"&OFFSET('Product Classes'!$C$9,MATCH('Product Classes'!H10,MODEL_PCS,0),0)","v":"PC1 - Vented Electric, Standard (4.4 ft3 or greater capacity)"}]
[]
{"$rows_left_out":24}
{"sheet":"Efficiency Dist - MF","index":12,"n_rows":33,"n_cols":61,"rows_kept":33,"cut":false,"hidden":false,"merged":[[1,2,1,6],[3,2,3,6],[5,2,5,6]]}
[]
[null,null,"Efficiency Distributions by Product Class - Multi-Family"]
[]
[null,null,{"$f":"Navigation!$C$15","v":"NAVIGATION"}]
[]
[null,null,"COMMENTS"]
[]
[]
[null,null,null,{"$f":"'Product Classes'!H10&\" - \"&OFFSET('Product Classes'!$C$9,MATCH('Product Classes'!H10,MODEL_PCS,0),0)","v":"PC1 - Vented Electric, Standard (4.4 ft3 or greater capacity)"}]
[]
{"$rows_left_out":24}
{"sheet":"Efficiency Dist - MH","index":13,"n_rows":33,"n_cols":61,"rows_kept":33,"cut":false,"hidden":false,"merged":[[1,2,1,6],[3,2,3,6],[5,2,5,6]]}
[]
[null,null,"Efficiency Distributions by Product Class - Multi-Family"]
[]
[null,null,{"$f":"Navigation!$C$15","v":"NAVIGATION"}]
[]
[null,null,"COMMENTS"]
[]
[]
[null,null,null,{"$f":"'Product Classes'!H10&\" - \"&OFFSET('Product Classes'!$C$9,MATCH('Product Classes'!H10,MODEL_PCS,0),0)","v":"PC1 - Vented Electric, Standard (4.4 ft3 or greater capacity)"}]
[]
{"$rows_left_out":24}
{"sheet":"6P UEC Development","index":14,"n_rows":19,"n_cols":12,"rows_kept":19,"cut":false,"hidden":false,"merged":[]}
[]
[null,null,"6P UEC Development"]
[]
[null,null,"NAVIGATION"]
[]
[null,null,"COMMENTS"]
[]
[]
[null,null,"Top \"10\" Washer RMC"]
[]
{"$rows_left_out":10}
{"sheet":"Constants","index":15,"n_rows":13,"n_cols":4,"rows_kept":13,"cut":false,"hidden":false,"merged":[]}
[]
[null,null,"Constants"]
[]
[null,null,"NAVIGATION"]
[]
[null,null,"COMMENTS"]
[]
[]
[null,null,"Constant","Value"]
[null,null,"Hours/Day",24]
{"$rows_left_out":4}
{"sheet":"UEC Development","index":16,"n_rows":20,"n_cols":14,"rows_kept":20,"cut":false,"hidden":false,"merged":[[1,2,1,3],[10,7,10,9],[10,11,10,13],[10,3,10,5],[3,2,3,3],[5,2,5,3]]}
[]
[null,null,"UEC Development by Building Type"]
[]
[null,null,"NAVIGATION"]
[]
[null,null,"COMMENTS"]
[]
[]
[null,null,{"$f":"'Product Classes'!H10&\" - \"&OFFSET('Product Classes'!$C$9,MATCH('Product Classes'!H10,MODEL_PCS,0),0)","v":"PC1 - Vented Electric, Standard (4.4 ft3 or greater capacity)"}]
[]
{"$rows_left_out":11}
{"sheet":"UEC-SF","index":17,"n_rows":17,"n_cols":57,"rows_kept":17,"cut":false,"hidden":false,"merged":[]}
[]
[null,null,"Weighted Average Annual UEC - Single Family"]
[]
[null,null,"NAVIGATION"]
[]
[null,null,"COMMENTS"]
[]
[]
[null,null,"Market UEC (Shipment Weighted Average)"]
[null,null,null,1981,1982,1983,1984,1985,1986,1987,1988,1989,1990,1991,1992,1993,1994,1995,1996,1997,1998,1999,2000,2001,2002,2003,2004,2005,2006,2007,2008,2009,2010,2011,2012,2013,2014,2015,2016,2017,2018,2019,2020,2021,2022,2023,2024,2025,2026,2027,2028,2029,2030,2031,2032,2033,2034]
{"$rows_left_out":8}
{"sheet":"UEC-MF","index":18,"n_rows":17,"n_cols":57,"rows_kept":17,"cut":false,"hidden":false,"merged":[]}
[]
[null,null,"Weighted Average Annual UEC - Multi-Family"]
[]
[null,null,"NAVIGATION"]
[]
[null,null,"COMMENTS"]
[]
[]
[null,null,"Market UEC (Shipment Weighted Average)"]
[null,null,null,1981,1982,1983,1984,1985,1986,1987,1988,1989,1990,1991,1992,1993,1994,1995,1996,1997,1998,1999,2000,2001,2002,2003,2004,2005,2006,2007,2008,2009,2010,2011,2012,2013,2014,2015,2016,2017,2018,2019,2020,2021,2022,2023,2024,2025,2026,2027,2028,2029,2030,2031,2032,2033,2034]
{"$rows_left_out":8}
{"sheet":"UEC-MH","index":19,"n_rows":17,"n_cols":57,"rows_kept":17,"cut":false,"hidden":false,"merged":[]}
[]
[null,null,"Weighted Average Annual UEC - Manufactured Homes"]
[]
[null,null,"NAVIGATION"]
[]
[null,null,"COMMENTS"]
[]
[]
[null,null,"Market UEC (Shipment Weighted Average)"]
[null,null,null,1981,1982,1983,1984,1985,1986,1987,1988,1989,1990,1991,1992,1993,1994,1995,1996,1997,1998,1999,2000,2001,2002,2003,2004,2005,2006,2007,2008,2009,2010,2011,2012,2013,2014,2015,2016,2017,2018,2019,2020,2021,2022,2023,2024,2025,2026,2027,2028,2029,2030,2031,2032,2033,2034]
{"$rows_left_out":8}
{"sheet":"Results-SF","index":20,"n_rows":46,"n_cols":28,"rows_kept":46,"cut":false,"hidden":false,"merged":[]}
[]
[null,null,"RESULTS - Single Family"]
[]
[null,null,"NAVIGATION"]
[]
[null,null,"COMMENTS"]
[]
[]
[null,null,"SINGLE FAMILY"]
[]
{"$rows_left_out":37}
{"sheet":"Results-MF","index":21,"n_rows":46,"n_cols":28,"rows_kept":46,"cut":false,"hidden":false,"merged":[]}
[]
[null,null,"RESULTS - Multi-Family"]
[]
[null,null,"NAVIGATION"]
[]
[null,null,"COMMENTS"]
[]
[]
[null,null,"MULTI-FAMILY"]
[]
{"$rows_left_out":37}
{"sheet":"Results-MH","index":22,"n_rows":46,"n_cols":28,"rows_kept":46,"cut":false,"hidden":false,"merged":[]}
[]
[null,null,"RESULTS - Manufactured Homes"]
[]
[null,null,"NAVIGATION"]
[]
[null,null,"COMMENTS"]
[]
[]
[null,null,"MANUFACTURED HOMES"]
[]
{"$rows_left_out":37}
{"sheet":"Results-TH","index":23,"n_rows":46,"n_cols":28,"rows_kept":46,"cut":false,"hidden":false,"merged":[]}
[]
[null,null,"RESULTS - Total Homes"]
[]
[null,null,"NAVIGATION"]
[]
[null,null,"COMMENTS"]
[]
[]
[null,null,"TOTAL HOMES"]
[]
{"$rows_left_out":37}
{"sheet":"SUMMARY RESULTS","index":24,"n_rows":12,"n_cols":7,"rows_kept":12,"cut":false,"hidden":false,"merged":[]}
[]
[null,null,"SUMMARY RESULTS"]
[]
[null,null,"NAVIGATION"]
[]
[null,null,"COMMENTS"]
[]
[]
[null,null,{"$f":"MODEL_NAME","v":"Electric Clothes Dryers"},"Single Family","Multi-Family","Manufactured Homes","TOTAL"]
[null,null,"Adjustment to 6P Baseline (aMW)","n/a","n/a","n/a","n/a"]
{"$rows_left_out":3}
{"sheet":"Charts-SF","index":25,"n_rows":6,"n_cols":3,"rows_kept":6,"cut":false,"hidden":false,"merged":[]}
[]
[null,null,"CHARTS - Single Family"]
[]
[null,null,"NAVIGATION"]
[]
[null,null,"COMMENTS"]

{"sheet":"Charts-MF","index":26,"n_rows":6,"n_cols":3,"rows_kept":6,"cut":false,"hidden":false,"merged":[]}
[]
[null,null,"CHARTS - Multi-Family"]
[]
[null,null,"NAVIGATION"]
[]
[null,null,"COMMENTS"]

{"sheet":"Charts-MH","index":27,"n_rows":6,"n_cols":3,"rows_kept":6,"cut":false,"hidden":false,"merged":[]}
[]
[null,null,"CHARTS - Manufactured Homes"]
[]
[null,null,"NAVIGATION"]
[]
[null,null,"COMMENTS"]

{"sheet":"Charts-TH","index":28,"n_rows":6,"n_cols":3,"rows_kept":6,"cut":false,"hidden":false,"merged":[]}
[]
[null,null,"CHARTS - Total Homes"]
[]
[null,null,"NAVIGATION"]
[]
[null,null,"COMMENTS"]