{"text_format":"1","workbook":"xlsx","n_sheets":5,"sheets":["Utility Costs Summary (2017)","Utility Costs Summary (2020)","Sheet1","Asset List","Print View - Asset List"],"not_rendered":{"charts":4,"images":1,"macros":1,"external_links":0,"defined_names":60,"comments":2,"pivot_tables":0},"unopened":[],"bounds":{"document_bytes":16777216,"sheet_cells":100000,"rows_first":2000,"rows_last":500,"rows_between":2000,"halvings":0,"cell_chars":16384,"cell_head_chars":4096},"cells_cut":0,"cells_raw":0,"read":"whole","date_system":"1900"}

{"sheet":"Utility Costs Summary (2017)","index":0,"n_rows":34,"n_cols":13,"rows_kept":34,"cut":false,"hidden":true,"merged":[[0,0,0,11]]}
["TOP Cost Distribution Calculator"]
[null,null,null,null,null,null,"Projected Project Cost is",850,"thousand"]
[]
[null,null,null,"Utility Cost Breakdown",null,null,16,"Peak MW Load is derived from the BPA 2014 FERC-714 Power System Report"]
[null,null,null,null,null,null,null,"Toggle","Utility Customers","Line Segments","Buses","Peak MW Load","Share of TOP Cost"]
[null,null,null,null,null,null,null,false,"Benton County PUD No. 1 ",{"$f":"VLOOKUP(I6,'Asset List'!$B$3:$Q$113,14,0)","v":0},{"$f":"VLOOKUP(I6,'Asset List'!$B$3:$Q$113,16,0)","v":0},429.2,{"$f":"IF(H6,$D$12+$D$19*J6+$D$20*K6+$D$15*L6,0)","v":0}]
[null,null,null,null,null,null,null,false,"Clark Public Utilities",{"$f":"VLOOKUP(I7,'Asset List'!$B$3:$Q$113,14,0)","v":15},{"$f":"VLOOKUP(I7,'Asset List'!$B$3:$Q$113,16,0)","v":11},1033,0]
[null,null,null,null,null,null,null,true,"Cowlitz County PUD No. 1",{"$f":"VLOOKUP(I8,'Asset List'!$B$3:$Q$113,14,0)","v":15},{"$f":"VLOOKUP(I8,'Asset List'!$B$3:$Q$113,16,0)","v":26},742.1,239243.92239333197]
[null,null,null,null,null,null," ",false,"Eugene Water and Electric Board",{"$f":"VLOOKUP(I9,'Asset List'!$B$3:$Q$113,14,0)","v":38},{"$f":"VLOOKUP(I9,'Asset List'!$B$3:$Q$113,16,0)","v":32},498,0]
[null,null,null,null,null,null,null,true,"Grays Harbor County PUD No. 1 ",{"$f":"VLOOKUP(I10,'Asset List'!$B$3:$Q$113,14,0)","v":1},{"$f":"VLOOKUP(I10,'Asset List'!$B$3:$Q$113,16,0)","v":2},261.60000000000002,61638.136103383622]
[null,null,null,null,null,null,null,true,"Klickitat County PUD No. 1 ",{"$f":"VLOOKUP(I11,'Asset List'!$B$3:$Q$113,14,0)","v":7},{"$f":"VLOOKUP(I11,'Asset List'!$B$3:$Q$113,16,0)","v":7},77.900000000000006,92430.943219096167]
[null,null,"Utility Base Charge:",30000,{"$f":"CONCATENATE(\"(or \",ROUND((D12*COUNTIF(H6:H20,TRUE))/(H2*1000)*100,0),\"% of  utility cost)\")","v":"(or 35% of  utility cost)"},null,null,true,"Lower Valley Energy",{"$f":"VLOOKUP(I12,'Asset List'!$B$3:$Q$113,14,0)","v":8},{"$f":"VLOOKUP(I12,'Asset List'!$B$3:$Q$113,16,0)","v":5},174,100121.11456159288]
[null,null,null,null,null,null,null,true,"Lewis County PUD No. 1",{"$f":"VLOOKUP(I13,'Asset List'!$B$3:$Q$113,14,0)","v":2},{"$f":"VLOOKUP(I13,'Asset List'!$B$3:$Q$113,16,0)","v":2},232.8,64685.598054529408]
[null,null,"Utility Load Charge:",0.2,"of the total utility cost",null,null,true,"Northern Wasco ",{"$f":"VLOOKUP(I14,'Asset List'!$B$3:$Q$113,14,0)","v":1},{"$f":"VLOOKUP(I14,'Asset List'!$B$3:$Q$113,16,0)","v":1},102.3,46214.480443193897]
[null,null,null,{"$f":"(H2*1000*D14)/(SUMIF(H6:H20,\"TRUE\",L6:L20))","v":80.022594614950123},"per MW",null,null,true,"Okanogan County PUD No. 1",{"$f":"VLOOKUP(I15,'Asset List'!$B$3:$Q$113,14,0)","v":5},{"$f":"VLOOKUP(I15,'Asset List'!$B$3:$Q$113,16,0)","v":3},167,78152.505695062864]
[null,null,null,null,null,null,null,true,"Pend Oreille County PUD No. 1",{"$f":"VLOOKUP(I16,'Asset List'!$B$3:$Q$113,14,0)","v":4},{"$f":"VLOOKUP(I16,'Asset List'!$B$3:$Q$113,16,0)","v":5},116,74071.353369700417]
[null,null,"Line & Bus Charge:",{"$f":"CONCATENATE(\"Remaining \",ROUND(100*((H2*1000)-(D12*COUNTIF(H6:H20,TRUE))-(D14*H2*1000))/(H2*1000),0),\"% of the total utility cost\")","v":"Remaining 45% of the total utility cost"},null,null,null,false,"Snohonomish County PUD",{"$f":"VLOOKUP(I17,'Asset List'!$B$3:$Q$113,14,0)","v":{"$error":"#N/A"}},{"$f":"VLOOKUP(I17,'Asset List'!$B$3:$Q$113,16,0)","v":{"$error":"#N/A"}},1466,0]
[null,null,"Cost per bus section is",0.5,"of the cost per line segment",null,null,false,"Springfield Utility Board ",{"$f":"VLOOKUP(I18,'Asset List'!$B$3:$Q$113,14,0)","v":11},{"$f":"VLOOKUP(I18,'Asset List'!$B$3:$Q$113,16,0)","v":7},179.8,0]
[null,null,null,{"$f":"((H2*1000)-(D12*COUNTIF(H6:H20,TRUE))-(D14*H2*1000))/(SUMIF(H6:H20,TRUE,J6:J20)+D18*SUMIF(H6:H20,TRUE,K6:K20))","v":5352.1126760563384},"per line segment",null,null,true,"Umatilla Electric Cooperative ",{"$f":"VLOOKUP(I19,'Asset List'!$B$3:$Q$113,14,0)","v":1},{"$f":"VLOOKUP(I19,'Asset List'!$B$3:$Q$113,16,0)","v":0},222,53117.128680575261]
[null,null,null,{"$f":"D19*D18","v":2676.0563380281692},"per bus",null,null,true,"Whatcom County PUD No. 1 ",{"$f":"VLOOKUP(I20,'Asset List'!$B$3:$Q$113,14,0)","v":1},{"$f":"VLOOKUP(I20,'Asset List'!$B$3:$Q$113,16,0)","v":1},28.7,40324.817479533573]
{"$rows_left_out":15}
{"sheet":"Utility Costs Summary (2020)","index":1,"n_rows":36,"n_cols":14,"rows_kept":36,"cut":false,"hidden":false,"merged":[[0,0,0,11],[4,7,4,12]]}
["2022 TP Cost Distribution Calculator"]
[null,null,null,null,null,null,"Projected Resource Cost =",306,"thousand"]
[null,null,null,null,null,null,"Adjustment from the 2021 year =",null,"thousand"]
[null,null,null,null,null,null,"2022 Projected Project Cost =",{"$f":"H2-H3","v":306},"thousand"]
[null,null,null,null,null,null,null," "]
[null,null,null,"Utility Cost Breakdown",null,null,16,"Peak MW Load is derived from the BPA (6/2021) FERC-714 Power System Report"]
[null,null,null,null,null,null,null,"Toggle","Utility Customers","Line Segments","Buses","Peak MW Load","Share of TP Cost"]
[null,null,null,null,null,null,null,true,"Klickitat County PUD No. 1 ",7,7,80,{"$f":"IF(H8,$D$14+$D$21*J8+$D$22*K8+$D$17*L8,0)","v":49512.408985282724}]
[null,null,null,null,null,null,null,true,"Lewis County PUD No. 1",2,2,178,34358.109992254067]
[null,null,null,null,null,null," ",true,"Northern Wasco ",1,1,138,28501.905499612702]
[null,null,null,null,null,null,null,true,"Pend Oreille County PUD No. 1",4,5,133,41464.879938032536]
[null,null,null,null,null,null,null,true,"Umatilla Electric Cooperative ",5,3,576,62465.344694035637]
[null,null,null,null,null,null,null,true,"Whatcom County PUD No. 1 ",1,1,29,23334.748257164989]
[null,null,"Utility Base Charge:",18000,{"$f":"CONCATENATE(\"(or \",ROUND((D14*COUNTIF(H8:H14,TRUE))/(H4*1000)*100,0),\"% of  utility cost)\")","v":"(or 41% of  utility cost)"},null,null,true,"Lower Valley Energy",10,11,157,66362.602633617353," "]
[]
[null,null,"Utility Load Charge:",0.2,"of the total utility cost",null,null,null,"View cost breakdown for:","Klickitat County PUD No. 1 "]
[null,null,null,{"$f":"(H4*1000*D16)/(SUMIF(H8:H14,\"TRUE\",L8:L14))","v":47.405112316034085},"per MW"]
[]
[null,null,"Line & Bus Charge:",{"$f":"CONCATENATE(\"Remaining \",ROUND(100*((H4*1000)-(D14*COUNTIF(H8:H14,TRUE))-(D16*H4*1000))/(H4*1000),0),\"% of the total utility cost\")","v":"Remaining 39% of the total utility cost"}]
[null,null,"Cost per bus section is",0.5,"of the cost per line segment"]
{"$rows_left_out":17}
{"sheet":"Sheet1","index":2,"n_rows":14,"n_cols":10,"rows_kept":14,"cut":false,"hidden":true,"merged":[]}
["customer","lines","lines total","bus","bus total","load","load total","Base","Total charge","monthly charge"]
["klick",7,{"$f":"B2*4770","v":33390},7,{"$f":"D2*2385","v":16695},79,{"$f":"F2*60.35","v":4767.6500000000005},18000,{"$f":"C2+E2+G2+H2","v":72852.649999999994},{"$f":"I2/12","v":6071.0541666666659}]
["Lewis",2,{"$f":"B3*4770","v":9540},2,{"$f":"D3*2385","v":4770},223,13458.050000000001,18000,{"$f":"C3+E3+G3+H3","v":45768.05},{"$f":"I3/12","v":3814.0041666666671}]
["N. Wasco",1,4770,1,2385,111,6698.85,18000,31853.85,2654.4874999999997]
["POPUD",4,19080,5,11925,156,9414.6,18000,58419.6,4868.3]
["UEC",3,14310,2,4770,403,{"$f":"F6*60.35","v":24321.05},18000,61401.05,5116.7541666666666]
["Whatcom",1,4770,1,2385,28,{"$f":"F7*60.35","v":1689.8},18000,26844.799999999999,2237.0666666666666]
[null,null,null,null,null,null,null,null,{"$f":"SUM(I2:I7)","v":297140}]
[]
[]
[]
[]
["customer","lines","lines total","bus","bus total","load","load total","Base","Total charge","monthly charge"]
["Okanagon",5,{"$f":"B14*4770","v":23850},3,{"$f":"D14*2385","v":7155},142,{"$f":"F14*60.35","v":8569.7000000000007},18000,{"$f":"C14+E14+G14+H14","v":57574.7},{"$f":"I14/12","v":4797.8916666666664}]

{"sheet":"Asset List","index":3,"n_rows":134,"n_cols":18,"rows_kept":134,"cut":false,"hidden":true,"merged":[]}
[null,"Customer","Contract No.","Registration Status","Path","Line Segment","Buses",null,null,"Breakers","Disconnects","BES (Y/N)","BES Team Comment","Line Segment Count","Line Segment Count","Bus Section Count","Bus Section Count","Customer Perspective"]
["Included in TOP",null,null,null,null," Line Segments","Buses","Reactive device","Disconnect Switches","Transformers","Breakers/CS",null,null,null,null,null,null,"Customer Perspective"]
[1,"Clark Public Utilities","N/A","DP, GO, GOP TO, TOP","1. Ross - Hazel Dell 115 kV","Ross-Hazel Dell 115kV","Hazel Dell 115 kV",null,"?","Y",null,"Y",null,{"$f":"IF(F3=\"\",0,LEN(F3)-LEN(SUBSTITUTE(F3,\",\",\"\"))+1)","v":1},{"$f":"SUMIF(B:B,B3,N:N)","v":15},{"$f":"IF(G3=\"\",0,LEN(G3)-LEN(SUBSTITUTE(G3,\",\",\"\"))+1)","v":1},{"$f":"SUMIF(B:B,B3,P:P)","v":11},"Since they have been their own TOP, they may want to maintain some functional operation consistant with what they do today. This will be determined as we work through the TOP requirement checklist."]
[1,"Clark Public Utilities","N/A","DP, GO, GOP TO, TOP","2. Alcoa - River Road - Fruit Valley Tap 115 kV","Alcoa – River Road 115 kV,\nRiver Road - Fruit Valley Tap 115 kV","River Road 115 kV",null,"?","Y",null,"Y",null,2,15,1,11]
[1,"Clark Public Utilities","N/A","DP, GO, GOP TO, TOP","3. Sifton 2 – Alcoa 115 kV","Sifton 2 – 119th St. 115kV,\n119th St. – Cherry Grove 115kV,\nCherry Grove - Pioneer 115kV,\nPioneer- Alcoa 115 kV","119th St. 115 kV,\nCherry Grove 115 kV,\nPioneer 115 kV",null,null,"Y",null,"Y",null,4,15,3,11]
[1,"Clark Public Utilities","N/A","DP, GO, GOP TO, TOP","4. Sifton 1 - Silicon - Sifton 3 115 kV","Sifton 1 – Silicon 115kV,\nSilicon – Sifton 3 115kV","Silicon 115 kV",null,"?","Y",null,"Y",null,2,15,1,11]
[1,"Clark Public Utilities","N/A","DP, GO, GOP TO, TOP","5.  Sifton 5 – Lacamas - Wafertech - Runyan - Ast -Sifton 4 115 kV","Sifton 5 – Lacamas 115 kV,\nLacamas - Wafertech 115 kV,\nWafertech - Runyan 115 kV,\nRunyan - Joe Ast 115 kV,\nJoe Ast  - Sifton 4 115 kV","Lacamas 115 kV,\nWafertech 115 kV,\nRunyan 115 kV,\nJoe Ast 115 kV",null,"?","Y",null,"Y",null,5,15,4,11]
[1,"Clark Public Utilities","N/A","DP, GO, GOP TO, TOP","6.  Runyan - Troutdale 115 kV","Runyan - Troutdale 115 kV",null,null,"?","Y",null,"Y",null,1,15,0,11]
[1,"Clark Public Utilities","N/A","DP, GO, GOP TO, TOP","7. North Camas 115 kV Substation",null,"North Camas 115 kV",null,"?","Y",null,"Y",null,0,15,1,11]
[1,"Cowlitz County PUD No. 1","17TP-11235","DP, GO,GOP, LSE, TO","Lexington (BPA) - Shawnee (CPUD)","Lexington - Shawnee 115kV","Shawnee 115kV (CPUD)",null,null,"CS-115B1 (CPUD)","115B1-LD (CPUD)","Y",null,1,15,1,26,"No change to daily operations, except what would be required for BPA compliance "]
[1,"Cowlitz County PUD No. 1","17TP-11235","DP, GO,GOP, LSE, TO","Shawnee (CPUD) - East Kelso (CPUD)","Shawnee - East Kelso 115kV","Shawnee 115kV (CPUD),\nEast Kelso 115 kV (CPUD)",null,null,"115B2 (CPUD),\n115K1 (CPUD)","115B2-LD (CPUD),\n115B2-BD (CPUD),\n115k1-LD (CPUD),\n115k1-BD (CPUD)","Y",null,1,15,2,26]
[1,"Cowlitz County PUD No. 1","17TP-11235","DP, GO,GOP, LSE, TO","East Kelso (CPUD) - Soucth Kelso (CPUD)","East Kelso - South Kelso 115kV","East Kelso 115kV (CPUD),\nSouth kelso 115kV (CPUD)",null,null,"115K2 (CPUD),\n115K3 (CPUD)","115K2-LD (CPUD),\n115K2-BD (CPUD),\n115SK3-BD (CPUD)","Y",null,1,15,2,26]
[1,"Cowlitz County PUD No. 1","17TP-11235","DP, GO,GOP, LSE, TO","South Kelso (CPUD) - Carrolls (CPUD)","South Kelso - Cardwell 115kV","South Kelso 115kV (CPUD),\nCarrolls 115kV (CPUD)",null,null,"115SK1 (CPUD),\nCS-115S1 (CPUD)","115SK1-BED-BD (CPUD),\n115S1-LD (CPUD)","Y",null,1,15,2,26]
[1,"Cowlitz County PUD No. 1","17TP-11235","DP, GO,GOP, LSE, TO","Carrolls (CPUD) - Cardwell (BPA)","South Kelso - Cardwell 11 5kV","Carrolls 115kV (CPUD)",null,null,"CS-115S2 (CPUD)","115S2-LD (CPUD)","Y",null,1,15,1,26]
[1,"Cowlitz County PUD No. 1","17TP-11235","DP, GO,GOP, LSE, TO","Longview (BPA) - Washington Way (CPUD)",null,"Washington Way - 7th Ave 115kV  (CPUD)",null,null,"115W1 (CPUD)","115W1-LD (CPUD),\n115W1-BD (CPUD)","Y",null,0,15,1,26]
[1,"Cowlitz County PUD No. 1","17TP-11235","DP, GO,GOP, LSE, TO","Washington Way (CPUD) - 7th Ave (CPUD)","Washington Way - 7th Ave 115kV","Washington Way - 7th Ave 115kV   (CPUD)",null,null,"115W2 (CPUD),\n115H2 (CPUD)","115W2-LD (CPUD),\n115W2-BD (CPUD),\n115H2-LD (CPUD),\n115H2-BD (CPUD","Y",null,1,15,1,26]
[1,"Cowlitz County PUD No. 1","17TP-11235","DP, GO,GOP, LSE, TO","7th Ave (CPUD) - Cowlitz (BPA)","7th Ave - Cowlitz 115kV","7th Ave - Cowlitz 115kV (CPUD)",null,null,"115H1 (CPUD)","115H1-LD (CPUD),\n115H1-BD (CPUD,\n115C6 N.O. (CPUD) at Columbia Way","Y",null,1,15,1,26]
[1,"Cowlitz County PUD No. 1","17TP-11235","DP, GO,GOP, LSE, TO","7th Ave (CPUD) - East Kelso (CPUD)","7th Ave - East Kelso 115kV","7th Ave 115kV (CPUD),\nEast Kelso 115kV (CPUD)",null,null,"115H3 (CPUD),\n115K5 (CPUD)","115H3-LD (CPUD),\n115H3-BD (CPUD),\n115K5-LD (CPUD),\n115K5-BD (CPUD)","Y",null,1,15,2,26]
[1,"Cowlitz County PUD No. 1","17TP-11235","DP, GO,GOP, LSE, TO","Longview (BPA) - Mint Farm (CPUD)","Longview - Mint Farm 115kV","Mint Farm 115kV (CPUD",null,null,"115MF1 (CPUD)","115MF1-LD (CPUD),\n115MF1-BD (CPUD)","Y",null,1,15,1,26]
[1,"Cowlitz County PUD No. 1","17TP-11235","DP, GO,GOP, LSE, TO","Mint Farm (CPUD) - Olive Way (CPUD)","Mint Farm - Olive Way 115kV","Mint Farm 115kV (CPUD,\nOlive Way 115kV (CPUD)",null,null,"115MF3 (CPUD),\n115L2 (CPUD)","115MF3-LD (CPUD),\n115MF3-BD (CPUD),\n115L2-LD (CPUD),\n115L2-BD (CPUD)","Y",null,1,15,2,26]
{"$rows_left_out":115}
{"sheet":"Print View - Asset List","index":4,"n_rows":123,"n_cols":7,"rows_kept":123,"cut":false,"hidden":true,"merged":[]}
[{"$f":"'Asset List'!B1","v":"Customer"},{"$f":"'Asset List'!E1","v":"Path"},{"$f":"'Asset List'!F2","v":" Line Segments"},{"$f":"'Asset List'!G2","v":"Buses"},{"$f":"'Asset List'!I2","v":"Disconnect Switches"},{"$f":"'Asset List'!K2","v":"Breakers/CS"},{"$f":"'Asset List'!R2","v":"Customer Perspective"}]
[{"$f":"'Asset List'!B3","v":"Clark Public Utilities"},{"$f":"IF('Asset List'!E3=\"\",\"\",'Asset List'!E3)","v":"1. Ross - Hazel Dell 115 kV"},{"$f":"IF('Asset List'!F3=\"\",\"\",'Asset List'!F3)","v":"Ross-Hazel Dell 115kV"},{"$f":"IF('Asset List'!G3=\"\",\"\",'Asset List'!G3)","v":"Hazel Dell 115 kV"},{"$f":"IF('Asset List'!I3=\"\",\"\",'Asset List'!I3)","v":"?"},{"$f":"IF('Asset List'!K3=\"\",\"\",'Asset List'!K3)","v":""},{"$f":"IF('Asset List'!R3=\"\",\"\",'Asset List'!R3)","v":"Since they have been their own TOP, they may want to maintain some functional operation consistant with what they do today. This will be determined as we work through the TOP requirement checklist."}]
[{"$f":"'Asset List'!B4","v":"Clark Public Utilities"},{"$f":"IF('Asset List'!E4=\"\",\"\",'Asset List'!E4)","v":"2. Alcoa - River Road - Fruit Valley Tap 115 kV"},{"$f":"IF('Asset List'!F4=\"\",\"\",'Asset List'!F4)","v":"Alcoa – River Road 115 kV,\nRiver Road - Fruit Valley Tap 115 kV"},{"$f":"IF('Asset List'!G4=\"\",\"\",'Asset List'!G4)","v":"River Road 115 kV"},{"$f":"IF('Asset List'!I4=\"\",\"\",'Asset List'!I4)","v":"?"},{"$f":"IF('Asset List'!K4=\"\",\"\",'Asset List'!K4)","v":""},{"$f":"IF('Asset List'!R4=\"\",\"\",'Asset List'!R4)","v":""}]
[{"$f":"'Asset List'!B5","v":"Clark Public Utilities"},{"$f":"IF('Asset List'!E5=\"\",\"\",'Asset List'!E5)","v":"3. Sifton 2 – Alcoa 115 kV"},{"$f":"IF('Asset List'!F5=\"\",\"\",'Asset List'!F5)","v":"Sifton 2 – 119th St. 115kV,\n119th St. – Cherry Grove 115kV,\nCherry Grove - Pioneer 115kV,\nPioneer- Alcoa 115 kV"},{"$f":"IF('Asset List'!G5=\"\",\"\",'Asset List'!G5)","v":"119th St. 115 kV,\nCherry Grove 115 kV,\nPioneer 115 kV"},{"$f":"IF('Asset List'!I5=\"\",\"\",'Asset List'!I5)","v":""},{"$f":"IF('Asset List'!K5=\"\",\"\",'Asset List'!K5)","v":""},{"$f":"IF('Asset List'!R5=\"\",\"\",'Asset List'!R5)","v":""}]
[{"$f":"'Asset List'!B6","v":"Clark Public Utilities"},{"$f":"IF('Asset List'!E6=\"\",\"\",'Asset List'!E6)","v":"4. Sifton 1 - Silicon - Sifton 3 115 kV"},{"$f":"IF('Asset List'!F6=\"\",\"\",'Asset List'!F6)","v":"Sifton 1 – Silicon 115kV,\nSilicon – Sifton 3 115kV"},{"$f":"IF('Asset List'!G6=\"\",\"\",'Asset List'!G6)","v":"Silicon 115 kV"},{"$f":"IF('Asset List'!I6=\"\",\"\",'Asset List'!I6)","v":"?"},{"$f":"IF('Asset List'!K6=\"\",\"\",'Asset List'!K6)","v":""},{"$f":"IF('Asset List'!R6=\"\",\"\",'Asset List'!R6)","v":""}]
[{"$f":"'Asset List'!B7","v":"Clark Public Utilities"},{"$f":"IF('Asset List'!E7=\"\",\"\",'Asset List'!E7)","v":"5.  Sifton 5 – Lacamas - Wafertech - Runyan - Ast -Sifton 4 115 kV"},{"$f":"IF('Asset List'!F7=\"\",\"\",'Asset List'!F7)","v":"Sifton 5 – Lacamas 115 kV,\nLacamas - Wafertech 115 kV,\nWafertech - Runyan 115 kV,\nRunyan - Joe Ast 115 kV,\nJoe Ast  - Sifton 4 115 kV"},{"$f":"IF('Asset List'!G7=\"\",\"\",'Asset List'!G7)","v":"Lacamas 115 kV,\nWafertech 115 kV,\nRunyan 115 kV,\nJoe Ast 115 kV"},{"$f":"IF('Asset List'!I7=\"\",\"\",'Asset List'!I7)","v":"?"},{"$f":"IF('Asset List'!K7=\"\",\"\",'Asset List'!K7)","v":""},{"$f":"IF('Asset List'!R7=\"\",\"\",'Asset List'!R7)","v":""}]
[{"$f":"'Asset List'!B8","v":"Clark Public Utilities"},{"$f":"IF('Asset List'!E8=\"\",\"\",'Asset List'!E8)","v":"6.  Runyan - Troutdale 115 kV"},{"$f":"IF('Asset List'!F8=\"\",\"\",'Asset List'!F8)","v":"Runyan - Troutdale 115 kV"},{"$f":"IF('Asset List'!G8=\"\",\"\",'Asset List'!G8)","v":""},{"$f":"IF('Asset List'!I8=\"\",\"\",'Asset List'!I8)","v":"?"},{"$f":"IF('Asset List'!K8=\"\",\"\",'Asset List'!K8)","v":""},{"$f":"IF('Asset List'!R8=\"\",\"\",'Asset List'!R8)","v":""}]
[{"$f":"'Asset List'!B9","v":"Clark Public Utilities"},{"$f":"IF('Asset List'!E9=\"\",\"\",'Asset List'!E9)","v":"7. North Camas 115 kV Substation"},{"$f":"IF('Asset List'!F9=\"\",\"\",'Asset List'!F9)","v":""},{"$f":"IF('Asset List'!G9=\"\",\"\",'Asset List'!G9)","v":"North Camas 115 kV"},{"$f":"IF('Asset List'!I9=\"\",\"\",'Asset List'!I9)","v":"?"},{"$f":"IF('Asset List'!K9=\"\",\"\",'Asset List'!K9)","v":""},{"$f":"IF('Asset List'!R9=\"\",\"\",'Asset List'!R9)","v":""}]
[{"$f":"'Asset List'!B10","v":"Cowlitz County PUD No. 1"},{"$f":"IF('Asset List'!E10=\"\",\"\",'Asset List'!E10)","v":"Lexington (BPA) - Shawnee (CPUD)"},{"$f":"IF('Asset List'!F10=\"\",\"\",'Asset List'!F10)","v":"Lexington - Shawnee 115kV"},{"$f":"IF('Asset List'!G10=\"\",\"\",'Asset List'!G10)","v":"Shawnee 115kV (CPUD)"},{"$f":"IF('Asset List'!I10=\"\",\"\",'Asset List'!I10)","v":""},{"$f":"IF('Asset List'!K10=\"\",\"\",'Asset List'!K10)","v":"115B1-LD (CPUD)"},{"$f":"IF('Asset List'!R10=\"\",\"\",'Asset List'!R10)","v":"No change to daily operations, except what would be required for BPA compliance "}]
[{"$f":"'Asset List'!B11","v":"Cowlitz County PUD No. 1"},{"$f":"IF('Asset List'!E11=\"\",\"\",'Asset List'!E11)","v":"Shawnee (CPUD) - East Kelso (CPUD)"},{"$f":"IF('Asset List'!F11=\"\",\"\",'Asset List'!F11)","v":"Shawnee - East Kelso 115kV"},{"$f":"IF('Asset List'!G11=\"\",\"\",'Asset List'!G11)","v":"Shawnee 115kV (CPUD),\nEast Kelso 115 kV (CPUD)"},{"$f":"IF('Asset List'!I11=\"\",\"\",'Asset List'!I11)","v":""},{"$f":"IF('Asset List'!K11=\"\",\"\",'Asset List'!K11)","v":"115B2-LD (CPUD),\n115B2-BD (CPUD),\n115k1-LD (CPUD),\n115k1-BD (CPUD)"},{"$f":"IF('Asset List'!R11=\"\",\"\",'Asset List'!R11)","v":""}]
[{"$f":"'Asset List'!B12","v":"Cowlitz County PUD No. 1"},{"$f":"IF('Asset List'!E12=\"\",\"\",'Asset List'!E12)","v":"East Kelso (CPUD) - Soucth Kelso (CPUD)"},{"$f":"IF('Asset List'!F12=\"\",\"\",'Asset List'!F12)","v":"East Kelso - South Kelso 115kV"},{"$f":"IF('Asset List'!G12=\"\",\"\",'Asset List'!G12)","v":"East Kelso 115kV (CPUD),\nSouth kelso 115kV (CPUD)"},{"$f":"IF('Asset List'!I12=\"\",\"\",'Asset List'!I12)","v":""},{"$f":"IF('Asset List'!K12=\"\",\"\",'Asset List'!K12)","v":"115K2-LD (CPUD),\n115K2-BD (CPUD),\n115SK3-BD (CPUD)"},{"$f":"IF('Asset List'!R12=\"\",\"\",'Asset List'!R12)","v":""}]
[{"$f":"'Asset List'!B13","v":"Cowlitz County PUD No. 1"},{"$f":"IF('Asset List'!E13=\"\",\"\",'Asset List'!E13)","v":"South Kelso (CPUD) - Carrolls (CPUD)"},{"$f":"IF('Asset List'!F13=\"\",\"\",'Asset List'!F13)","v":"South Kelso - Cardwell 115kV"},{"$f":"IF('Asset List'!G13=\"\",\"\",'Asset List'!G13)","v":"South Kelso 115kV (CPUD),\nCarrolls 115kV (CPUD)"},{"$f":"IF('Asset List'!I13=\"\",\"\",'Asset List'!I13)","v":""},{"$f":"IF('Asset List'!K13=\"\",\"\",'Asset List'!K13)","v":"115SK1-BED-BD (CPUD),\n115S1-LD (CPUD)"},{"$f":"IF('Asset List'!R13=\"\",\"\",'Asset List'!R13)","v":""}]
[{"$f":"'Asset List'!B14","v":"Cowlitz County PUD No. 1"},{"$f":"IF('Asset List'!E14=\"\",\"\",'Asset List'!E14)","v":"Carrolls (CPUD) - Cardwell (BPA)"},{"$f":"IF('Asset List'!F14=\"\",\"\",'Asset List'!F14)","v":"South Kelso - Cardwell 11 5kV"},{"$f":"IF('Asset List'!G14=\"\",\"\",'Asset List'!G14)","v":"Carrolls 115kV (CPUD)"},{"$f":"IF('Asset List'!I14=\"\",\"\",'Asset List'!I14)","v":""},{"$f":"IF('Asset List'!K14=\"\",\"\",'Asset List'!K14)","v":"115S2-LD (CPUD)"},{"$f":"IF('Asset List'!R14=\"\",\"\",'Asset List'!R14)","v":""}]
[{"$f":"'Asset List'!B15","v":"Cowlitz County PUD No. 1"},{"$f":"IF('Asset List'!E15=\"\",\"\",'Asset List'!E15)","v":"Longview (BPA) - Washington Way (CPUD)"},{"$f":"IF('Asset List'!F15=\"\",\"\",'Asset List'!F15)","v":""},{"$f":"IF('Asset List'!G15=\"\",\"\",'Asset List'!G15)","v":"Washington Way - 7th Ave 115kV  (CPUD)"},{"$f":"IF('Asset List'!I15=\"\",\"\",'Asset List'!I15)","v":""},{"$f":"IF('Asset List'!K15=\"\",\"\",'Asset List'!K15)","v":"115W1-LD (CPUD),\n115W1-BD (CPUD)"},{"$f":"IF('Asset List'!R15=\"\",\"\",'Asset List'!R15)","v":""}]
[{"$f":"'Asset List'!B16","v":"Cowlitz County PUD No. 1"},{"$f":"IF('Asset List'!E16=\"\",\"\",'Asset List'!E16)","v":"Washington Way (CPUD) - 7th Ave (CPUD)"},{"$f":"IF('Asset List'!F16=\"\",\"\",'Asset List'!F16)","v":"Washington Way - 7th Ave 115kV"},{"$f":"IF('Asset List'!G16=\"\",\"\",'Asset List'!G16)","v":"Washington Way - 7th Ave 115kV   (CPUD)"},{"$f":"IF('Asset List'!I16=\"\",\"\",'Asset List'!I16)","v":""},{"$f":"IF('Asset List'!K16=\"\",\"\",'Asset List'!K16)","v":"115W2-LD (CPUD),\n115W2-BD (CPUD),\n115H2-LD (CPUD),\n115H2-BD (CPUD"},{"$f":"IF('Asset List'!R16=\"\",\"\",'Asset List'!R16)","v":""}]
[{"$f":"'Asset List'!B17","v":"Cowlitz County PUD No. 1"},{"$f":"IF('Asset List'!E17=\"\",\"\",'Asset List'!E17)","v":"7th Ave (CPUD) - Cowlitz (BPA)"},{"$f":"IF('Asset List'!F17=\"\",\"\",'Asset List'!F17)","v":"7th Ave - Cowlitz 115kV"},{"$f":"IF('Asset List'!G17=\"\",\"\",'Asset List'!G17)","v":"7th Ave - Cowlitz 115kV (CPUD)"},{"$f":"IF('Asset List'!I17=\"\",\"\",'Asset List'!I17)","v":""},{"$f":"IF('Asset List'!K17=\"\",\"\",'Asset List'!K17)","v":"115H1-LD (CPUD),\n115H1-BD (CPUD,\n115C6 N.O. (CPUD) at Columbia Way"},{"$f":"IF('Asset List'!R17=\"\",\"\",'Asset List'!R17)","v":""}]
[{"$f":"'Asset List'!B18","v":"Cowlitz County PUD No. 1"},{"$f":"IF('Asset List'!E18=\"\",\"\",'Asset List'!E18)","v":"7th Ave (CPUD) - East Kelso (CPUD)"},{"$f":"IF('Asset List'!F18=\"\",\"\",'Asset List'!F18)","v":"7th Ave - East Kelso 115kV"},{"$f":"IF('Asset List'!G18=\"\",\"\",'Asset List'!G18)","v":"7th Ave 115kV (CPUD),\nEast Kelso 115kV (CPUD)"},{"$f":"IF('Asset List'!I18=\"\",\"\",'Asset List'!I18)","v":""},{"$f":"IF('Asset List'!K18=\"\",\"\",'Asset List'!K18)","v":"115H3-LD (CPUD),\n115H3-BD (CPUD),\n115K5-LD (CPUD),\n115K5-BD (CPUD)"},{"$f":"IF('Asset List'!R18=\"\",\"\",'Asset List'!R18)","v":""}]
[{"$f":"'Asset List'!B19","v":"Cowlitz County PUD No. 1"},{"$f":"IF('Asset List'!E19=\"\",\"\",'Asset List'!E19)","v":"Longview (BPA) - Mint Farm (CPUD)"},{"$f":"IF('Asset List'!F19=\"\",\"\",'Asset List'!F19)","v":"Longview - Mint Farm 115kV"},{"$f":"IF('Asset List'!G19=\"\",\"\",'Asset List'!G19)","v":"Mint Farm 115kV (CPUD"},{"$f":"IF('Asset List'!I19=\"\",\"\",'Asset List'!I19)","v":""},{"$f":"IF('Asset List'!K19=\"\",\"\",'Asset List'!K19)","v":"115MF1-LD (CPUD),\n115MF1-BD (CPUD)"},{"$f":"IF('Asset List'!R19=\"\",\"\",'Asset List'!R19)","v":""}]
[{"$f":"'Asset List'!B20","v":"Cowlitz County PUD No. 1"},{"$f":"IF('Asset List'!E20=\"\",\"\",'Asset List'!E20)","v":"Mint Farm (CPUD) - Olive Way (CPUD)"},{"$f":"IF('Asset List'!F20=\"\",\"\",'Asset List'!F20)","v":"Mint Farm - Olive Way 115kV"},{"$f":"IF('Asset List'!G20=\"\",\"\",'Asset List'!G20)","v":"Mint Farm 115kV (CPUD,\nOlive Way 115kV (CPUD)"},{"$f":"IF('Asset List'!I20=\"\",\"\",'Asset List'!I20)","v":""},{"$f":"IF('Asset List'!K20=\"\",\"\",'Asset List'!K20)","v":"115MF3-LD (CPUD),\n115MF3-BD (CPUD),\n115L2-LD (CPUD),\n115L2-BD (CPUD)"},{"$f":"IF('Asset List'!R20=\"\",\"\",'Asset List'!R20)","v":""}]
[{"$f":"'Asset List'!B21","v":"Cowlitz County PUD No. 1"},{"$f":"IF('Asset List'!E21=\"\",\"\",'Asset List'!E21)","v":"Olive Way (CPUD) - 20th & Ocean Beach (CPUD)"},{"$f":"IF('Asset List'!F21=\"\",\"\",'Asset List'!F21)","v":"Olive Way - 20th & Ocean Beach 115kV"},{"$f":"IF('Asset List'!G21=\"\",\"\",'Asset List'!G21)","v":"Olive Way 115kV (CPUD),\nOcean Beach 115kV (CPUD)"},{"$f":"IF('Asset List'!I21=\"\",\"\",'Asset List'!I21)","v":""},{"$f":"IF('Asset List'!K21=\"\",\"\",'Asset List'!K21)","v":"115E2-LD (CPUD),\n115E2-BD (CPUD),\n115J1-LD (CPUD),\n115J2-BD (CPUD)"},{"$f":"IF('Asset List'!R21=\"\",\"\",'Asset List'!R21)","v":""}]
{"$rows_left_out":103}